BDBM50437502 CHEMBL2409625
SMILES: COCC[C@H]1C[C@@H]1c1cncc(OC[C@@H]2CCCN2)c1
InChI Key: InChIKey=UAFJMITWUKBNEN-NOLJZWGESA-N
Data: 1 IC50  1 EC50
Activity Spreadsheet -- Enzyme Inhibition Constant Data from BindingDB
Found 2 hits for monomerid = 50437502
Trg + Lig
Ki
nM
ΔG°
kcal/mole
IC50
nM
Kd
nM
EC50/IC50
nM
koff
s-1
kon
M-1s-1
pHTemp
°C
Neuronal acetylcholine receptor Alpha-4/Beta-2
(Homo sapiens (Human))
BDBM50437502
(CHEMBL2409625)
Show SMILES COCC[C@H]1C[C@@H]1c1cncc(OC[C@@H]2CCCN2)c1 |r|
Show InChI InChI=1S/C16H24N2O2/c1-19-6-4-12-8-16(12)13-7-15(10-17-9-13)20-11-14-3-2-5-18-14/h7,9-10,12,14,16,18H,2-6,8,11H2,1H3/t12-,14-,16-/m0/s1
NCI pathway
Reactome pathway
n/an/an/an/a 23n/an/an/an/a
University of Illinois at Chicago
Curated by ChEMBL
Assay Description
Agonist activity at human alpha4beta2 nACHR expressed in human SHEP1 cells assessed as stimulation of 86Rb+ ion efflux after 5 mins by liquid scintil...
J Med Chem 56: 5495-504 (2014)
Article DOI: 10.1021/jm400510u
BindingDB Entry DOI: 10.7270/Q23J3FCH
Neuronal acetylcholine receptor Alpha-4/Beta-2
(Homo sapiens (Human))
BDBM50437502
(CHEMBL2409625)
Show SMILES COCC[C@H]1C[C@@H]1c1cncc(OC[C@@H]2CCCN2)c1 |r|
Show InChI InChI=1S/C16H24N2O2/c1-19-6-4-12-8-16(12)13-7-15(10-17-9-13)20-11-14-3-2-5-18-14/h7,9-10,12,14,16,18H,2-6,8,11H2,1H3/t12-,14-,16-/m0/s1
NCI pathway
Reactome pathway
n/an/a 108n/an/an/an/an/an/a
University of Illinois at Chicago
Curated by ChEMBL
Assay Description
Antagonist activity at human alpha4beta2 nACHR expressed in human SHEP1 cells assessed as inhibition of carbamylcholine-induced 86Rb+ ion efflux prei...
J Med Chem 56: 5495-504 (2014)
Article DOI: 10.1021/jm400510u
BindingDB Entry DOI: 10.7270/Q23J3FCH