BDBM50437558 CHEMBL598022
SMILES: CCCCCCCCCCCCN1C(=O)c2cccc3c(NCCNCCN(C)C)ccc(C1=O)c23
InChI Key: InChIKey=SATGSKMWRADRHF-UHFFFAOYSA-N
Data: 2 IC50
Activity Spreadsheet -- Enzyme Inhibition Constant Data from BindingDB
Found 2 hits for monomerid = 50437558
Trg + Lig
Ki
nM
ΔG°
kcal/mole
IC50
nM
Kd
nM
EC50/IC50
nM
koff
s-1
kon
M-1s-1
pHTemp
°C
Platelet-derived growth factor receptor alpha
(Homo sapiens (Human))
BDBM50437558
(CHEMBL598022)
Show SMILES CCCCCCCCCCCCN1C(=O)c2cccc3c(NCCNCCN(C)C)ccc(C1=O)c23
Show InChI InChI=1S/C30H46N4O2/c1-4-5-6-7-8-9-10-11-12-13-22-34-29(35)25-16-14-15-24-27(18-17-26(28(24)25)30(34)36)32-20-19-31-21-23-33(2)3/h14-18,31-32H,4-13,19-23H2,1-3H3
n/an/a 2.62E+4n/an/an/an/an/an/a
East China University of Science and Technology
Curated by ChEMBL
Assay Description
Inhibition of PDGFRalpha (unknown origin) using poly (Glu, Tyr)4:1 as substrate by ELISA
Eur J Med Chem 65: 477-86 (2013)
Article DOI: 10.1016/j.ejmech.2013.05.002
BindingDB Entry DOI: 10.7270/Q2B27WQ7
Platelet-derived growth factor receptor beta
(Homo sapiens (Human))
BDBM50437558
(CHEMBL598022)
Show SMILES CCCCCCCCCCCCN1C(=O)c2cccc3c(NCCNCCN(C)C)ccc(C1=O)c23
Show InChI InChI=1S/C30H46N4O2/c1-4-5-6-7-8-9-10-11-12-13-22-34-29(35)25-16-14-15-24-27(18-17-26(28(24)25)30(34)36)32-20-19-31-21-23-33(2)3/h14-18,31-32H,4-13,19-23H2,1-3H3
NCI pathway
Reactome pathway
n/an/a>5.00E+4n/an/an/an/an/an/a
East China University of Science and Technology
Curated by ChEMBL
Assay Description
Inhibition of PDGFRbeta (unknown origin) using poly (Glu, Tyr)4:1 as substrate by ELISA
Eur J Med Chem 65: 477-86 (2013)
Article DOI: 10.1016/j.ejmech.2013.05.002
BindingDB Entry DOI: 10.7270/Q2B27WQ7