BDBM50437562 CHEMBL2407517
SMILES: CCN1C(=O)c2cccc3c(NCCNCCN(C)C)ccc(C1=O)c23
InChI Key: InChIKey=UCCNPKCKOIQIAD-UHFFFAOYSA-N
Data: 2 IC50
Activity Spreadsheet -- Enzyme Inhibition Constant Data from BindingDB
Found 2 hits for monomerid = 50437562
Trg + Lig
Ki
nM
ΔG°
kcal/mole
IC50
nM
Kd
nM
EC50/IC50
nM
koff
s-1
kon
M-1s-1
pHTemp
°C
Platelet-derived growth factor receptor alpha
(Homo sapiens (Human))
BDBM50437562
(CHEMBL2407517)
Show SMILES CCN1C(=O)c2cccc3c(NCCNCCN(C)C)ccc(C1=O)c23
Show InChI InChI=1S/C20H26N4O2/c1-4-24-19(25)15-7-5-6-14-17(9-8-16(18(14)15)20(24)26)22-11-10-21-12-13-23(2)3/h5-9,21-22H,4,10-13H2,1-3H3
n/an/a>1.00E+5n/an/an/an/an/an/a
East China University of Science and Technology
Curated by ChEMBL
Assay Description
Inhibition of PDGFRalpha (unknown origin) using poly (Glu, Tyr)4:1 as substrate by ELISA
Eur J Med Chem 65: 477-86 (2013)
Article DOI: 10.1016/j.ejmech.2013.05.002
BindingDB Entry DOI: 10.7270/Q2B27WQ7
Platelet-derived growth factor receptor beta
(Homo sapiens (Human))
BDBM50437562
(CHEMBL2407517)
Show SMILES CCN1C(=O)c2cccc3c(NCCNCCN(C)C)ccc(C1=O)c23
Show InChI InChI=1S/C20H26N4O2/c1-4-24-19(25)15-7-5-6-14-17(9-8-16(18(14)15)20(24)26)22-11-10-21-12-13-23(2)3/h5-9,21-22H,4,10-13H2,1-3H3
NCI pathway
Reactome pathway
n/an/a>1.00E+5n/an/an/an/an/an/a
East China University of Science and Technology
Curated by ChEMBL
Assay Description
Inhibition of PDGFRbeta (unknown origin) using poly (Glu, Tyr)4:1 as substrate by ELISA
Eur J Med Chem 65: 477-86 (2013)
Article DOI: 10.1016/j.ejmech.2013.05.002
BindingDB Entry DOI: 10.7270/Q2B27WQ7