BDBM50437663 CHEMBL2408059
SMILES: CCN(CC)c1ncc(N(CC)C(=O)c2ccsc2)c(N[C@@H](Cc2ccc(OC(=O)N3CCCC3)cc2)C(O)=O)n1
InChI Key: InChIKey=KGDZUGSBEBVXKQ-QHCPKHFHSA-N
Data: 3 IC50
Activity Spreadsheet -- Enzyme Inhibition Constant Data from BindingDB
Found 3 hits for monomerid = 50437663
Trg + Lig
Ki
nM
ΔG°
kcal/mole
IC50
nM
Kd
nM
EC50/IC50
nM
koff
s-1
kon
M-1s-1
pHTemp
°C
Fibronectin receptor beta/Integrin alpha-4
(Homo sapiens (Human))
BDBM50437663
(CHEMBL2408059)
Show SMILES CCN(CC)c1ncc(N(CC)C(=O)c2ccsc2)c(N[C@@H](Cc2ccc(OC(=O)N3CCCC3)cc2)C(O)=O)n1 |r|
Show InChI InChI=1S/C29H36N6O5S/c1-4-33(5-2)28-30-18-24(35(6-3)26(36)21-13-16-41-19-21)25(32-28)31-23(27(37)38)17-20-9-11-22(12-10-20)40-29(39)34-14-7-8-15-34/h9-13,16,18-19,23H,4-8,14-15,17H2,1-3H3,(H,37,38)(H,30,31,32)/t23-/m0/s1
Reactome pathway
n/an/a 1.79E+3n/an/an/an/an/an/a
Elan Pharmaceuticals
Curated by ChEMBL
Assay Description
Inhibition of alpha4beta1 integrin-mediated human jurkat cell adhesion to fibronectin in presence of human serum albumin
Bioorg Med Chem Lett 23: 4370-3 (2013)
Article DOI: 10.1016/j.bmcl.2013.05.076
BindingDB Entry DOI: 10.7270/Q22J6D91
Fibronectin receptor beta/Integrin alpha-4
(Homo sapiens (Human))
BDBM50437663
(CHEMBL2408059)
Show SMILES CCN(CC)c1ncc(N(CC)C(=O)c2ccsc2)c(N[C@@H](Cc2ccc(OC(=O)N3CCCC3)cc2)C(O)=O)n1 |r|
Show InChI InChI=1S/C29H36N6O5S/c1-4-33(5-2)28-30-18-24(35(6-3)26(36)21-13-16-41-19-21)25(32-28)31-23(27(37)38)17-20-9-11-22(12-10-20)40-29(39)34-14-7-8-15-34/h9-13,16,18-19,23H,4-8,14-15,17H2,1-3H3,(H,37,38)(H,30,31,32)/t23-/m0/s1
Reactome pathway
n/an/a 1.80n/an/an/an/an/an/a
Elan Pharmaceuticals
Curated by ChEMBL
Assay Description
Inhibition of alpha4beta1 integrin-mediated human jurkat cell adhesion to fibronectin in absence of human serum albumin
Bioorg Med Chem Lett 23: 4370-3 (2013)
Article DOI: 10.1016/j.bmcl.2013.05.076
BindingDB Entry DOI: 10.7270/Q22J6D91
Integrin α4β7
(Homo sapiens (Human))
BDBM50437663
(CHEMBL2408059)
Show SMILES CCN(CC)c1ncc(N(CC)C(=O)c2ccsc2)c(N[C@@H](Cc2ccc(OC(=O)N3CCCC3)cc2)C(O)=O)n1 |r|
Show InChI InChI=1S/C29H36N6O5S/c1-4-33(5-2)28-30-18-24(35(6-3)26(36)21-13-16-41-19-21)25(32-28)31-23(27(37)38)17-20-9-11-22(12-10-20)40-29(39)34-14-7-8-15-34/h9-13,16,18-19,23H,4-8,14-15,17H2,1-3H3,(H,37,38)(H,30,31,32)/t23-/m0/s1
NCI pathway
Reactome pathway
n/an/a 36n/an/an/an/an/an/a
Elan Pharmaceuticals
Curated by ChEMBL
Assay Description
Inhibition of alpha4beta7 integrin-mediated human 8866 cell adhesion to MadCAM-1
Bioorg Med Chem Lett 23: 4370-3 (2013)
Article DOI: 10.1016/j.bmcl.2013.05.076
BindingDB Entry DOI: 10.7270/Q22J6D91