BDBM50437697 CHEMBL2408678
SMILES: CCOc1cc(ccc1O)[C@H]1Oc2cc(O)cc(O)c2C[C@H]1O
InChI Key: InChIKey=JWPMSOATDHFFLB-RHSMWYFYSA-N
Data: 1 EC50
Activity Spreadsheet -- Enzyme Inhibition Constant Data from BindingDB
Found 1 hit for monomerid = 50437697
Trg + Lig
Ki
nM
ΔG°
kcal/mole
IC50
nM
Kd
nM
EC50/IC50
nM
koff
s-1
kon
M-1s-1
pHTemp
°C
Nitric Oxide Synthase, endothelial
(Bos taurus (bovine))
BDBM50437697
(CHEMBL2408678)
Show SMILES CCOc1cc(ccc1O)[C@H]1Oc2cc(O)cc(O)c2C[C@H]1O |r|
Show InChI InChI=1S/C17H18O6/c1-2-22-16-5-9(3-4-12(16)19)17-14(21)8-11-13(20)6-10(18)7-15(11)23-17/h3-7,14,17-21H,2,8H2,1H3/t14-,17-/m1/s1
n/an/an/an/a 1n/an/an/an/a
University of California
Curated by ChEMBL
Assay Description
Activation of eNOS in BCAEC assessed as increase in nitric oxide level after 10 mins by fluorometric analysis
Bioorg Med Chem Lett 23: 4441-6 (2013)
Article DOI: 10.1016/j.bmcl.2013.05.079
BindingDB Entry DOI: 10.7270/Q2P84D93