BDBM50437819 CHEMBL2407738
SMILES: Nc1ccccc1NC(=O)c1ccc(CSC2=N[C@@H](Cc3ccccc3)CS2)cc1
InChI Key: InChIKey=WRYXQFHJMFMAQK-FQEVSTJZSA-N
Data: 1 IC50
Activity Spreadsheet -- Enzyme Inhibition Constant Data from BindingDB
Found 1 hit for monomerid = 50437819
Trg + Lig
Ki
nM
ΔG°
kcal/mole
IC50
nM
Kd
nM
EC50/IC50
nM
koff
s-1
kon
M-1s-1
pHTemp
°C
Nuclear receptor corepressor 1
(Homo sapiens (Human))
BDBM50437819
(CHEMBL2407738)
Show SMILES Nc1ccccc1NC(=O)c1ccc(CSC2=N[C@@H](Cc3ccccc3)CS2)cc1 |r,t:17|
Show InChI InChI=1S/C24H23N3OS2/c25-21-8-4-5-9-22(21)27-23(28)19-12-10-18(11-13-19)15-29-24-26-20(16-30-24)14-17-6-2-1-3-7-17/h1-13,20H,14-16,25H2,(H,27,28)/t20-/m0/s1
Reactome pathway
n/an/a 509n/an/an/an/an/an/a
University College London
Curated by ChEMBL
Assay Description
Inhibition of recombinant HDAC3-NCoR1 (unknown origin) using MAL as substrate incubated for 3 hrs prior to substrate addition measured after 60 mins ...
J Med Chem 56: 6156-74 (2013)
Article DOI: 10.1021/jm400634n
BindingDB Entry DOI: 10.7270/Q2N87C65