BDBM50438033 CHEMBL2409605
SMILES: CNC(=O)c1ccccc1Nc1ncnc(Nc2cc(OC)c(OC)c(OC)c2)n1
InChI Key: InChIKey=UQGQBHYGCQYHMP-UHFFFAOYSA-N
Data: 2 IC50
PDB links: 1 PDB ID matches this monomer.
Activity Spreadsheet -- Enzyme Inhibition Constant Data from BindingDB
Found 2 hits for monomerid = 50438033
Trg + Lig
Ki
nM
ΔG°
kcal/mole
IC50
nM
Kd
nM
EC50/IC50
nM
koff
s-1
kon
M-1s-1
pHTemp
°C
Focal adhesion kinase 1
(Homo sapiens (Human))
BDBM50438033
(CHEMBL2409605)
Show SMILES CNC(=O)c1ccccc1Nc1ncnc(Nc2cc(OC)c(OC)c(OC)c2)n1
Show InChI InChI=1S/C20H22N6O4/c1-21-18(27)13-7-5-6-8-14(13)25-20-23-11-22-19(26-20)24-12-9-15(28-2)17(30-4)16(10-12)29-3/h5-11H,1-4H3,(H,21,27)(H2,22,23,24,25,26)
NCI pathway
Reactome pathway
n/an/a 400n/an/an/an/an/an/a
Universit£ Paris Descartes
Curated by ChEMBL
Assay Description
Inhibition of FAK (unknown origin) using ULight-poly GT as substrate after 1.6 hrs by TR-FRET assay
J Med Chem 58: 237-51 (2015)
Article DOI: 10.1021/jm500784e
BindingDB Entry DOI: 10.7270/Q2B27WZC
3D
3D Structure (crystal)
Focal adhesion kinase 1
(Homo sapiens (Human))
BDBM50438033
(CHEMBL2409605)
Show SMILES CNC(=O)c1ccccc1Nc1ncnc(Nc2cc(OC)c(OC)c(OC)c2)n1
Show InChI InChI=1S/C20H22N6O4/c1-21-18(27)13-7-5-6-8-14(13)25-20-23-11-22-19(26-20)24-12-9-15(28-2)17(30-4)16(10-12)29-3/h5-11H,1-4H3,(H,21,27)(H2,22,23,24,25,26)
NCI pathway
Reactome pathway
n/an/a 400n/an/an/an/an/an/a
Universit£ Paris Descartes
Curated by ChEMBL
Assay Description
Inhibition of pre-activated recombinant full length FAK (unknown origin) using ULight labeled poly(Glu/Tyr) as substrate after 1.6 hrs by TR-FRET ass...
Bioorg Med Chem Lett 23: 4552-6 (2013)
Article DOI: 10.1016/j.bmcl.2013.06.038
BindingDB Entry DOI: 10.7270/Q2GM88RC
3D
3D Structure (crystal)