BDBM50438168 CHEMBL2409889
SMILES: Cc1ccc(cc1)-c1csc(Nc2ccc(CCN3CC[C@H](O)C[C@@H]3CO)cc2)n1
InChI Key: InChIKey=XVUAWKMAHFBSFJ-YADHBBJMSA-N
Data: 2 IC50
Activity Spreadsheet -- Enzyme Inhibition Constant Data from BindingDB
Found 2 hits for monomerid = 50438168
Trg + Lig
Ki
nM
ΔG°
kcal/mole
IC50
nM
Kd
nM
EC50/IC50
nM
koff
s-1
kon
M-1s-1
pHTemp
°C
Sphingosine kinase 1 (SPHK1)
(Homo sapiens (Human))
BDBM50438168
(CHEMBL2409889)
Show SMILES Cc1ccc(cc1)-c1csc(Nc2ccc(CCN3CC[C@H](O)C[C@@H]3CO)cc2)n1 |r|
Show InChI InChI=1S/C24H29N3O2S/c1-17-2-6-19(7-3-17)23-16-30-24(26-23)25-20-8-4-18(5-9-20)10-12-27-13-11-22(29)14-21(27)15-28/h2-9,16,21-22,28-29H,10-15H2,1H3,(H,25,26)/t21-,22+/m1/s1
n/an/a 7n/an/an/an/an/an/a
Amgen Inc.
Curated by ChEMBL
Assay Description
Inhibition of purified human SphK1 assessed as inhibition of formation of [33P]-S1P after 50 mins by scintillation counting
Bioorg Med Chem Lett 23: 4608-16 (2013)
Article DOI: 10.1016/j.bmcl.2013.06.030
BindingDB Entry DOI: 10.7270/Q2736SB3
Sphingosine kinase types 2 (SphK2)
(Homo sapiens (Human))
BDBM50438168
(CHEMBL2409889)
Show SMILES Cc1ccc(cc1)-c1csc(Nc2ccc(CCN3CC[C@H](O)C[C@@H]3CO)cc2)n1 |r|
Show InChI InChI=1S/C24H29N3O2S/c1-17-2-6-19(7-3-17)23-16-30-24(26-23)25-20-8-4-18(5-9-20)10-12-27-13-11-22(29)14-21(27)15-28/h2-9,16,21-22,28-29H,10-15H2,1H3,(H,25,26)/t21-,22+/m1/s1
n/an/a 110n/an/an/an/an/an/a
Amgen Inc.
Curated by ChEMBL
Assay Description
Inhibition of purified human SphK2 assessed as inhibition of formation of [33P]-S1P after 50 mins by scintillation counting
Bioorg Med Chem Lett 23: 4608-16 (2013)
Article DOI: 10.1016/j.bmcl.2013.06.030
BindingDB Entry DOI: 10.7270/Q2736SB3