BDBM50438435 CHEMBL2414377
SMILES: Cc1ccc(cc1)-n1c(n[nH]c1=S)-c1csc(N)n1
InChI Key: InChIKey=FWVYOIGVPSHPBB-UHFFFAOYSA-N
Data: 1 IC50
Activity Spreadsheet -- Enzyme Inhibition Constant Data from BindingDB
Found 1 hit for monomerid = 50438435
Trg + Lig
Ki
nM
ΔG°
kcal/mole
IC50
nM
Kd
nM
EC50/IC50
nM
koff
s-1
kon
M-1s-1
pHTemp
°C
Dihydrofolate reductase (DHFR)
(Bos taurus (Cattle))
BDBM50438435
(CHEMBL2414377)
Show SMILES Cc1ccc(cc1)-n1c(n[nH]c1=S)-c1csc(N)n1
Show InChI InChI=1S/C12H11N5S2/c1-7-2-4-8(5-3-7)17-10(15-16-12(17)18)9-6-19-11(13)14-9/h2-6H,1H3,(H2,13,14)(H,16,18)
n/an/a 2.40E+4n/an/an/an/an/an/a
King Saud University
Curated by ChEMBL
Assay Description
Inhibition of bovine liver DHFR measured every 1 min for 10 mins
Eur J Med Chem 66: 135-45 (2013)
Article DOI: 10.1016/j.ejmech.2013.05.039
BindingDB Entry DOI: 10.7270/Q21C1Z9Q