BDBM50438553 CHEMBL2413144
SMILES: CN(C)CCN(Cc1ccc(Cl)c(Cl)c1)C(=O)c1cc2scc(c2n1-c1ccc(F)cc1)C(F)(F)F
InChI Key: InChIKey=NAUIRPNTTXLCCK-UHFFFAOYSA-N
Data: 1 IC50
Activity Spreadsheet -- Enzyme Inhibition Constant Data from BindingDB
Found 1 hit for monomerid = 50438553
Trg + Lig
Ki
nM
ΔG°
kcal/mole
IC50
nM
Kd
nM
EC50/IC50
nM
koff
s-1
kon
M-1s-1
pHTemp
°C
Centromere-associated protein E
(Homo sapiens (Human))
BDBM50438553
(CHEMBL2413144)
Show SMILES CN(C)CCN(Cc1ccc(Cl)c(Cl)c1)C(=O)c1cc2scc(c2n1-c1ccc(F)cc1)C(F)(F)F
Show InChI InChI=1S/C25H21Cl2F4N3OS/c1-32(2)9-10-33(13-15-3-8-19(26)20(27)11-15)24(35)21-12-22-23(18(14-36-22)25(29,30)31)34(21)17-6-4-16(28)5-7-17/h3-8,11-12,14H,9-10,13H2,1-2H3
NCI pathway
Reactome pathway
n/an/a 140n/an/an/an/an/an/a
Takeda Pharmaceutical Company Limited
Curated by ChEMBL
Assay Description
Inhibition of human ATPase activity of CENP-E motor domain assessed as ADP production after 60 mins by ADP-Glo luminescence assay
Bioorg Med Chem 21: 5488-502 (2013)
Article DOI: 10.1016/j.bmc.2013.05.067
BindingDB Entry DOI: 10.7270/Q20G3MKN