BDBM50438563 CHEMBL2413134
SMILES: CN(Cc1ccc(Cl)c(Cl)c1)C(=O)c1c(-c2ccc(F)cc2)c2cscc2c(=O)n1CCO
InChI Key: InChIKey=VTCORKXNZJLJSR-UHFFFAOYSA-N
Data: 1 IC50
Activity Spreadsheet -- Enzyme Inhibition Constant Data from BindingDB
Found 1 hit for monomerid = 50438563
Trg + Lig
Ki
nM
ΔG°
kcal/mole
IC50
nM
Kd
nM
EC50/IC50
nM
koff
s-1
kon
M-1s-1
pHTemp
°C
Centromere-associated protein E
(Homo sapiens (Human))
BDBM50438563
(CHEMBL2413134)
Show SMILES CN(Cc1ccc(Cl)c(Cl)c1)C(=O)c1c(-c2ccc(F)cc2)c2cscc2c(=O)n1CCO
Show InChI InChI=1S/C24H19Cl2FN2O3S/c1-28(11-14-2-7-19(25)20(26)10-14)24(32)22-21(15-3-5-16(27)6-4-15)17-12-33-13-18(17)23(31)29(22)8-9-30/h2-7,10,12-13,30H,8-9,11H2,1H3
NCI pathway
Reactome pathway
n/an/a 1.80E+3n/an/an/an/an/an/a
Takeda Pharmaceutical Company Limited
Curated by ChEMBL
Assay Description
Inhibition of human ATPase activity of CENP-E motor domain assessed as ADP production after 60 mins by ADP-Glo luminescence assay
Bioorg Med Chem 21: 5488-502 (2013)
Article DOI: 10.1016/j.bmc.2013.05.067
BindingDB Entry DOI: 10.7270/Q20G3MKN