BDBM50438607 CHEMBL2414050
SMILES: Nc1cccc2c1cc(Cc1ccccc1)[nH]c2=O
InChI Key: InChIKey=ICHUPJLXMRFVPX-UHFFFAOYSA-N
Data: 1 IC50
Activity Spreadsheet -- Enzyme Inhibition Constant Data from BindingDB
Found 1 hit for monomerid = 50438607
Trg + Lig
Ki
nM
ΔG°
kcal/mole
IC50
nM
Kd
nM
EC50/IC50
nM
koff
s-1
kon
M-1s-1
pHTemp
°C
Poly [ADP-ribose] polymerase 1
(Homo sapiens (Human))
BDBM50438607
(CHEMBL2414050)
Show SMILES Nc1cccc2c1cc(Cc1ccccc1)[nH]c2=O
Show InChI InChI=1S/C16H14N2O/c17-15-8-4-7-13-14(15)10-12(18-16(13)19)9-11-5-2-1-3-6-11/h1-8,10H,9,17H2,(H,18,19)
n/an/a 5.14E+3n/an/an/an/an/an/a
University of Bath
Curated by ChEMBL
Assay Description
Inhibition of human PARP-1 assessed as synthesis of [3H]-ADP-ribose polymers from [3H]-NAD+ by scintillation proximity assay
Bioorg Med Chem 21: 5218-27 (2013)
Article DOI: 10.1016/j.bmc.2013.06.031
BindingDB Entry DOI: 10.7270/Q2BP047D