BDBM50438608 CHEMBL2414049
SMILES: CCCCCc1cc2c(N)cccc2c(=O)[nH]1
InChI Key: InChIKey=LHCBLZMUDUKRFG-UHFFFAOYSA-N
Data: 1 IC50
PDB links: 1 PDB ID matches this monomer.
Activity Spreadsheet -- Enzyme Inhibition Constant Data from BindingDB
Found 1 hit for monomerid = 50438608
Trg + Lig
Ki
nM
ΔG°
kcal/mole
IC50
nM
Kd
nM
EC50/IC50
nM
koff
s-1
kon
M-1s-1
pHTemp
°C
Poly [ADP-ribose] polymerase 1
(Homo sapiens (Human))
BDBM50438608
(CHEMBL2414049)
Show SMILES CCCCCc1cc2c(N)cccc2c(=O)[nH]1
Show InChI InChI=1S/C14H18N2O/c1-2-3-4-6-10-9-12-11(14(17)16-10)7-5-8-13(12)15/h5,7-9H,2-4,6,15H2,1H3,(H,16,17)
n/an/a 320n/an/an/an/an/an/a
University of Bath
Curated by ChEMBL
Assay Description
Inhibition of human PARP-1 assessed as synthesis of [3H]-ADP-ribose polymers from [3H]-NAD+ by scintillation proximity assay
Bioorg Med Chem 21: 5218-27 (2013)
Article DOI: 10.1016/j.bmc.2013.06.031
BindingDB Entry DOI: 10.7270/Q2BP047D