BDBM50438666 CHEMBL2414542
SMILES: CC(C)n1cc(cn1)-c1cccn2nc(Nc3ccc(cc3)C(O)=O)nc12
InChI Key: InChIKey=AYPDRLYCPNYUMB-UHFFFAOYSA-N
Data: 1 KI  1 IC50
Activity Spreadsheet -- Enzyme Inhibition Constant Data from BindingDB
Found 2 hits for monomerid = 50438666
Trg + Lig
Ki
nM
ΔG°
kcal/mole
IC50
nM
Kd
nM
EC50/IC50
nM
koff
s-1
kon
M-1s-1
pHTemp
°C
Tyrosine-protein kinase JAK2
(Homo sapiens (Human))
BDBM50438666
(CHEMBL2414542)
Show SMILES CC(C)n1cc(cn1)-c1cccn2nc(Nc3ccc(cc3)C(O)=O)nc12
Show InChI InChI=1S/C19H18N6O2/c1-12(2)25-11-14(10-20-25)16-4-3-9-24-17(16)22-19(23-24)21-15-7-5-13(6-8-15)18(26)27/h3-12H,1-2H3,(H,21,23)(H,26,27)
Reactome pathway
0.5n/an/an/an/an/an/an/an/a
Genentech
Curated by ChEMBL
Assay Description
Inhibition of JAK2 (unknown origin)
Bioorg Med Chem Lett 23: 5014-21 (2013)
Article DOI: 10.1016/j.bmcl.2013.06.008
BindingDB Entry DOI: 10.7270/Q29S1SF2
Tyrosine-protein kinase JAK2
(Homo sapiens (Human))
BDBM50438666
(CHEMBL2414542)
Show SMILES CC(C)n1cc(cn1)-c1cccn2nc(Nc3ccc(cc3)C(O)=O)nc12
Show InChI InChI=1S/C19H18N6O2/c1-12(2)25-11-14(10-20-25)16-4-3-9-24-17(16)22-19(23-24)21-15-7-5-13(6-8-15)18(26)27/h3-12H,1-2H3,(H,21,23)(H,26,27)
Reactome pathway
n/an/a 151n/an/an/an/an/an/a
Genentech
Curated by ChEMBL
Assay Description
Inhibition of JAK2 in human SET2 cells assessed as reduction of phosphorylated STAT5 level
Bioorg Med Chem Lett 23: 5014-21 (2013)
Article DOI: 10.1016/j.bmcl.2013.06.008
BindingDB Entry DOI: 10.7270/Q29S1SF2