BDBM50438992 CHEMBL2420685
SMILES: COc1ccc2ccc(-c3cncnc3)c(Cl)c2c1
InChI Key: InChIKey=XHTUSXVMRHUIGE-UHFFFAOYSA-N
Data: 4 IC50
Activity Spreadsheet -- Enzyme Inhibition Constant Data from BindingDB
Found 4 hits for monomerid = 50438992
Trg + Lig
Ki
nM
ΔG°
kcal/mole
IC50
nM
Kd
nM
EC50/IC50
nM
koff
s-1
kon
M-1s-1
pHTemp
°C
Cytochrome P450 11B2, mitochondrial
(Homo sapiens (Human))
BDBM50438992
(CHEMBL2420685)
Show SMILES COc1ccc2ccc(-c3cncnc3)c(Cl)c2c1
Show InChI InChI=1S/C15H11ClN2O/c1-19-12-4-2-10-3-5-13(15(16)14(10)6-12)11-7-17-9-18-8-11/h2-9H,1H3
n/an/a 72n/an/an/an/an/an/a
Saarland University& Helmholtz Institute for Pharmaceutical Research Saarland (HIPS)
Curated by ChEMBL
Assay Description
Inhibition of human CYP11B2 expressed in hamster V79MZh cells using [1,2-3H]-11-deoxycorticosterone as substrate
J Med Chem 56: 6101-7 (2013)
Article DOI: 10.1021/jm400484p
BindingDB Entry DOI: 10.7270/Q2CJ8FX2
Cytochrome P450 11B1, mitochondrial
(Homo sapiens (Human))
BDBM50438992
(CHEMBL2420685)
Show SMILES COc1ccc2ccc(-c3cncnc3)c(Cl)c2c1
Show InChI InChI=1S/C15H11ClN2O/c1-19-12-4-2-10-3-5-13(15(16)14(10)6-12)11-7-17-9-18-8-11/h2-9H,1H3
n/an/a 1.23E+4n/an/an/an/an/an/a
Saarland University& Helmholtz Institute for Pharmaceutical Research Saarland (HIPS)
Curated by ChEMBL
Assay Description
Inhibition of human CYP11B1 expressed in hamster V79MZh cells using [1,2-3H]-11-deoxycorticosterone as substrate
J Med Chem 56: 6101-7 (2013)
Article DOI: 10.1021/jm400484p
BindingDB Entry DOI: 10.7270/Q2CJ8FX2
Aromatase
(Homo sapiens (Human))
BDBM50438992
(CHEMBL2420685)
Show SMILES COc1ccc2ccc(-c3cncnc3)c(Cl)c2c1
Show InChI InChI=1S/C15H11ClN2O/c1-19-12-4-2-10-3-5-13(15(16)14(10)6-12)11-7-17-9-18-8-11/h2-9H,1H3
Reactome pathway
n/an/a>2.00E+3n/an/an/an/an/an/a
Saarland University& Helmholtz Institute for Pharmaceutical Research Saarland (HIPS)
Curated by ChEMBL
Assay Description
Inhibition of CYP19 in human placental microsomes using [1beta-3H]androstenedione as substrate by 3H2O-method
J Med Chem 56: 6101-7 (2013)
Article DOI: 10.1021/jm400484p
BindingDB Entry DOI: 10.7270/Q2CJ8FX2
Steroid 17-alpha-hydroxylase/17,20 lyase
(Homo sapiens (Human))
BDBM50438992
(CHEMBL2420685)
Show SMILES COc1ccc2ccc(-c3cncnc3)c(Cl)c2c1
Show InChI InChI=1S/C15H11ClN2O/c1-19-12-4-2-10-3-5-13(15(16)14(10)6-12)11-7-17-9-18-8-11/h2-9H,1H3
Reactome pathway
n/an/a 632n/an/an/an/an/an/a
Saarland University& Helmholtz Institute for Pharmaceutical Research Saarland (HIPS)
Curated by ChEMBL
Assay Description
Inhibition of human CYP17 expressed in Escherichia coli using 1,2[3H]-progesterone as substrate in presence of NADPH
J Med Chem 56: 6101-7 (2013)
Article DOI: 10.1021/jm400484p
BindingDB Entry DOI: 10.7270/Q2CJ8FX2