BDBM50439520 CHEMBL2418346
SMILES: CCNC(=O)Nc1ccc(cc1)-c1nc(N2CCOC[C@@H]2C)c2n(C)ccc2n1
InChI Key: InChIKey=JMWDTMSHFAJXAF-AWEZNQCLSA-N
Data: 3 KI  2 IC50
Activity Spreadsheet -- Enzyme Inhibition Constant Data from BindingDB
Found 5 hits for monomerid = 50439520
Trg + Lig
Ki
nM
ΔG°
kcal/mole
IC50
nM
Kd
nM
EC50/IC50
nM
koff
s-1
kon
M-1s-1
pHTemp
°C
Serine/threonine-protein kinase mTOR
(Homo sapiens (Human))
BDBM50439520
(CHEMBL2418346)
Show SMILES CCNC(=O)Nc1ccc(cc1)-c1nc(N2CCOC[C@@H]2C)c2n(C)ccc2n1 |r|
Show InChI InChI=1S/C21H26N6O2/c1-4-22-21(28)23-16-7-5-15(6-8-16)19-24-17-9-10-26(3)18(17)20(25-19)27-11-12-29-13-14(27)2/h5-10,14H,4,11-13H2,1-3H3,(H2,22,23,28)/t14-/m0/s1
NCI pathway
Reactome pathway
19n/an/an/an/an/an/an/an/a
Genentech
Curated by ChEMBL
Assay Description
Inhibition of human recombinant mTOR (1360-2549) expressed in insect cells assessed as phosphorylation of recombinant (GFP)-4-EBP1 after 30 mins by L...
Bioorg Med Chem Lett 23: 5097-104 (2013)
Article DOI: 10.1016/j.bmcl.2013.07.027
BindingDB Entry DOI: 10.7270/Q2QN687D
Phosphatidylinositol 4,5-bisphosphate 3-kinase catalytic subunit delta isoform
(Homo sapiens (Human))
BDBM50439520
(CHEMBL2418346)
Show SMILES CCNC(=O)Nc1ccc(cc1)-c1nc(N2CCOC[C@@H]2C)c2n(C)ccc2n1 |r|
Show InChI InChI=1S/C21H26N6O2/c1-4-22-21(28)23-16-7-5-15(6-8-16)19-24-17-9-10-26(3)18(17)20(25-19)27-11-12-29-13-14(27)2/h5-10,14H,4,11-13H2,1-3H3,(H2,22,23,28)/t14-/m0/s1
NCI pathway
Reactome pathway
>1.00E+4n/an/an/an/an/an/an/an/a
Genentech
Curated by ChEMBL
Assay Description
Displacement of TAMRA-PIP3 from PI3Kdelta GRP-1 pleckstrin homology domain (unknown origin) assessed as formation of 3,4,5-inositoltriphosphate after...
Bioorg Med Chem Lett 23: 5097-104 (2013)
Article DOI: 10.1016/j.bmcl.2013.07.027
BindingDB Entry DOI: 10.7270/Q2QN687D
Phosphatidylinositol 4,5-bisphosphate 3-kinase catalytic subunit alpha isoform
(Homo sapiens (Human))
BDBM50439520
(CHEMBL2418346)
Show SMILES CCNC(=O)Nc1ccc(cc1)-c1nc(N2CCOC[C@@H]2C)c2n(C)ccc2n1 |r|
Show InChI InChI=1S/C21H26N6O2/c1-4-22-21(28)23-16-7-5-15(6-8-16)19-24-17-9-10-26(3)18(17)20(25-19)27-11-12-29-13-14(27)2/h5-10,14H,4,11-13H2,1-3H3,(H2,22,23,28)/t14-/m0/s1
NCI pathway
Reactome pathway
>1.00E+4n/an/an/an/an/an/an/an/a
Genentech
Curated by ChEMBL
Assay Description
Displacement of TAMRA-PIP3 from PI3Kalpha GRP-1 pleckstrin homology domain (unknown origin) assessed as formation of 3,4,5-inositoltriphosphate after...
Bioorg Med Chem Lett 23: 5097-104 (2013)
Article DOI: 10.1016/j.bmcl.2013.07.027
BindingDB Entry DOI: 10.7270/Q2QN687D
Serine/threonine-protein kinase mTOR
(Homo sapiens (Human))
BDBM50439520
(CHEMBL2418346)
Show SMILES CCNC(=O)Nc1ccc(cc1)-c1nc(N2CCOC[C@@H]2C)c2n(C)ccc2n1 |r|
Show InChI InChI=1S/C21H26N6O2/c1-4-22-21(28)23-16-7-5-15(6-8-16)19-24-17-9-10-26(3)18(17)20(25-19)27-11-12-29-13-14(27)2/h5-10,14H,4,11-13H2,1-3H3,(H2,22,23,28)/t14-/m0/s1
NCI pathway
Reactome pathway
n/an/a 110n/an/an/an/an/an/a
Genentech
Curated by ChEMBL
Assay Description
Inhibition of mTOR in PTEN deficient human PC3 cells assessed as inhibition of p70S6K phosphorylation
Bioorg Med Chem Lett 23: 5097-104 (2013)
Article DOI: 10.1016/j.bmcl.2013.07.027
BindingDB Entry DOI: 10.7270/Q2QN687D
Serine/threonine-protein kinase mTOR
(Homo sapiens (Human))
BDBM50439520
(CHEMBL2418346)
Show SMILES CCNC(=O)Nc1ccc(cc1)-c1nc(N2CCOC[C@@H]2C)c2n(C)ccc2n1 |r|
Show InChI InChI=1S/C21H26N6O2/c1-4-22-21(28)23-16-7-5-15(6-8-16)19-24-17-9-10-26(3)18(17)20(25-19)27-11-12-29-13-14(27)2/h5-10,14H,4,11-13H2,1-3H3,(H2,22,23,28)/t14-/m0/s1
NCI pathway
Reactome pathway
n/an/a 77n/an/an/an/an/an/a
Genentech
Curated by ChEMBL
Assay Description
Inhibition of mTOR in PTEN deficient human PC3 cells assessed as inhibition of Akt phosphorylation at Ser473
Bioorg Med Chem Lett 23: 5097-104 (2013)
Article DOI: 10.1016/j.bmcl.2013.07.027
BindingDB Entry DOI: 10.7270/Q2QN687D