BDBM50439638 CHEMBL2419599::US8993586, 82
SMILES: CNc1nccc2ccc(cc12)C(=O)N1CCC2(CC1)Cc1cn(nc1C(=O)N2)C(C)(C)C
InChI Key: InChIKey=FMDTZKACBQCRLG-UHFFFAOYSA-N
Data: 4 IC50
Activity Spreadsheet -- Enzyme Inhibition Constant Data from BindingDB
Found 4 hits for monomerid = 50439638
Trg + Lig
Ki
nM
ΔG°
kcal/mole
IC50
nM
Kd
nM
EC50/IC50
nM
koff
s-1
kon
M-1s-1
pHTemp
°C
Acetyl-CoA carboxylase 1 (ACC1)
(Homo sapiens (Human))
BDBM50439638
(CHEMBL2419599 | US8993586, 82)
Show SMILES CNc1nccc2ccc(cc12)C(=O)N1CCC2(CC1)Cc1cn(nc1C(=O)N2)C(C)(C)C
Show InChI InChI=1S/C25H30N6O2/c1-24(2,3)31-15-18-14-25(28-22(32)20(18)29-31)8-11-30(12-9-25)23(33)17-6-5-16-7-10-27-21(26-4)19(16)13-17/h5-7,10,13,15H,8-9,11-12,14H2,1-4H3,(H,26,27)(H,28,32)
US Patent
n/an/a 21n/an/an/an/a7.5n/a
Pfizer Inc.
US Patent
Assay Description
Preparation of rhACC1. Two liters of SF9 cells, infected with recombinant baculovirus containing full length human ACC1 cDNA, were suspended in ice-c...
US Patent US8993586 (2015)
BindingDB Entry DOI: 10.7270/Q2N58K43
Acetyl-CoA carboxylase 2 (ACC2)
(Homo sapiens (Human))
BDBM50439638
(CHEMBL2419599 | US8993586, 82)
Show SMILES CNc1nccc2ccc(cc12)C(=O)N1CCC2(CC1)Cc1cn(nc1C(=O)N2)C(C)(C)C
Show InChI InChI=1S/C25H30N6O2/c1-24(2,3)31-15-18-14-25(28-22(32)20(18)29-31)8-11-30(12-9-25)23(33)17-6-5-16-7-10-27-21(26-4)19(16)13-17/h5-7,10,13,15H,8-9,11-12,14H2,1-4H3,(H,26,27)(H,28,32)
Reactome pathway
n/an/a 6n/an/an/an/an/an/a
Pfizer Inc.
Curated by ChEMBL
Assay Description
Inhibition of human ACC2 using acetyl-CoA as substrate assessed as [14C]malonyl-CoA synthesis preincubated for 10 mins prior to substrate addition me...
J Med Chem 56: 7110-9 (2013)
Article DOI: 10.1021/jm401033t
BindingDB Entry DOI: 10.7270/Q2JW8G9D
Acetyl-CoA carboxylase 1 (ACC1)
(Homo sapiens (Human))
BDBM50439638
(CHEMBL2419599 | US8993586, 82)
Show SMILES CNc1nccc2ccc(cc12)C(=O)N1CCC2(CC1)Cc1cn(nc1C(=O)N2)C(C)(C)C
Show InChI InChI=1S/C25H30N6O2/c1-24(2,3)31-15-18-14-25(28-22(32)20(18)29-31)8-11-30(12-9-25)23(33)17-6-5-16-7-10-27-21(26-4)19(16)13-17/h5-7,10,13,15H,8-9,11-12,14H2,1-4H3,(H,26,27)(H,28,32)
n/an/a 18n/an/an/an/an/an/a
Pfizer Inc.
Curated by ChEMBL
Assay Description
Inhibition of human ACC1 using acetyl-CoA as substrate assessed as [14C]malonyl-CoA synthesis preincubated for 10 mins prior to substrate addition me...
J Med Chem 56: 7110-9 (2013)
Article DOI: 10.1021/jm401033t
BindingDB Entry DOI: 10.7270/Q2JW8G9D
Acetyl-CoA carboxylase 2 (ACC2)
(Homo sapiens (Human))
BDBM50439638
(CHEMBL2419599 | US8993586, 82)
Show SMILES CNc1nccc2ccc(cc12)C(=O)N1CCC2(CC1)Cc1cn(nc1C(=O)N2)C(C)(C)C
Show InChI InChI=1S/C25H30N6O2/c1-24(2,3)31-15-18-14-25(28-22(32)20(18)29-31)8-11-30(12-9-25)23(33)17-6-5-16-7-10-27-21(26-4)19(16)13-17/h5-7,10,13,15H,8-9,11-12,14H2,1-4H3,(H,26,27)(H,28,32)
Reactome pathway
US Patent
n/an/a 6.40n/an/an/an/an/an/a
Pfizer Inc.
US Patent
Assay Description
Preparation of rhACC2. Human ACC2 inhibition was measured using purified recombinant human ACC2 (hrACC2). Briefly, a full length Cytomax clone of ACC...
US Patent US8993586 (2015)
BindingDB Entry DOI: 10.7270/Q2N58K43