BDBM50439703 CHEMBL2418930
SMILES: CC(C)C1CCC(C)CC1OCC(=O)N1CCC(CCCC2CCN(CC2)c2ccc(cc2)C(=O)N2CCCC2C(N)=O)CC1
InChI Key: InChIKey=ULVLGXQAAXYZAX-UHFFFAOYSA-N
Data: 1 KI  1 IC50  1 EC50
Activity Spreadsheet -- Enzyme Inhibition Constant Data from BindingDB
Found 3 hits for monomerid = 50439703
Trg + Lig
Ki
nM
ΔG°
kcal/mole
IC50
nM
Kd
nM
EC50/IC50
nM
koff
s-1
kon
M-1s-1
pHTemp
°C
Ectonucleotide pyrophosphatase/phosphodiesterase family member 2
(Homo sapiens (Human))
BDBM50439703
(CHEMBL2418930)
Show SMILES CC(C)C1CCC(C)CC1OCC(=O)N1CCC(CCCC2CCN(CC2)c2ccc(cc2)C(=O)N2CCCC2C(N)=O)CC1
Show InChI InChI=1S/C37H58N4O4/c1-26(2)32-14-9-27(3)24-34(32)45-25-35(42)40-22-17-29(18-23-40)7-4-6-28-15-20-39(21-16-28)31-12-10-30(11-13-31)37(44)41-19-5-8-33(41)36(38)43/h10-13,26-29,32-34H,4-9,14-25H2,1-3H3,(H2,38,43)
100n/an/an/an/an/an/an/an/a
The University of Memphis
Curated by ChEMBL
Assay Description
Competitive inhibition of C-terminal FLAG-tagged human recombinant autotaxin using synthetic substrate FS-3 by Michaelis-Menten equation analysis
Bioorg Med Chem 21: 5548-60 (2013)
Article DOI: 10.1016/j.bmc.2013.05.061
BindingDB Entry DOI: 10.7270/Q2SF2XKS
Ectonucleotide pyrophosphatase/phosphodiesterase family member 2
(Homo sapiens (Human))
BDBM50439703
(CHEMBL2418930)
Show SMILES CC(C)C1CCC(C)CC1OCC(=O)N1CCC(CCCC2CCN(CC2)c2ccc(cc2)C(=O)N2CCCC2C(N)=O)CC1
Show InChI InChI=1S/C37H58N4O4/c1-26(2)32-14-9-27(3)24-34(32)45-25-35(42)40-22-17-29(18-23-40)7-4-6-28-15-20-39(21-16-28)31-12-10-30(11-13-31)37(44)41-19-5-8-33(41)36(38)43/h10-13,26-29,32-34H,4-9,14-25H2,1-3H3,(H2,38,43)
n/an/an/an/a 2.79E+3n/an/an/an/a
The University of Memphis
Curated by ChEMBL
Assay Description
Activation of C-terminal FLAG-tagged human recombinant autotaxin using paranitrophenyl thymidine monophosphate as substrate measured every 2 mins by ...
Bioorg Med Chem 21: 5548-60 (2013)
Article DOI: 10.1016/j.bmc.2013.05.061
BindingDB Entry DOI: 10.7270/Q2SF2XKS
Ectonucleotide pyrophosphatase/phosphodiesterase family member 2
(Homo sapiens (Human))
BDBM50439703
(CHEMBL2418930)
Show SMILES CC(C)C1CCC(C)CC1OCC(=O)N1CCC(CCCC2CCN(CC2)c2ccc(cc2)C(=O)N2CCCC2C(N)=O)CC1
Show InChI InChI=1S/C37H58N4O4/c1-26(2)32-14-9-27(3)24-34(32)45-25-35(42)40-22-17-29(18-23-40)7-4-6-28-15-20-39(21-16-28)31-12-10-30(11-13-31)37(44)41-19-5-8-33(41)36(38)43/h10-13,26-29,32-34H,4-9,14-25H2,1-3H3,(H2,38,43)
n/an/a 800n/an/an/an/an/an/a
The University of Memphis
Curated by ChEMBL
Assay Description
Inhibition of C-terminal FLAG-tagged human recombinant autotaxin using synthetic substrate FS-3 measured every 2 mins by FRET assay
Bioorg Med Chem 21: 5548-60 (2013)
Article DOI: 10.1016/j.bmc.2013.05.061
BindingDB Entry DOI: 10.7270/Q2SF2XKS