BDBM50440103 CHEMBL2426116
SMILES: CCCS(=O)(=O)NCC(C)(C)[C@@H](c1ccccc1)c1ccc2n(ncc2c1)-c1ccc(F)cc1
InChI Key: InChIKey=BNCWWKYKWMRIDX-SANMLTNESA-N
Data: 1 KI  3 EC50
Activity Spreadsheet -- Enzyme Inhibition Constant Data from BindingDB
Found 4 hits for monomerid = 50440103
Trg + Lig
Ki
nM
ΔG°
kcal/mole
IC50
nM
Kd
nM
EC50/IC50
nM
koff
s-1
kon
M-1s-1
pHTemp
°C
Glucocorticoid receptor
(Homo sapiens (Human))
BDBM50440103
(CHEMBL2426116)
Show SMILES CCCS(=O)(=O)NCC(C)(C)[C@@H](c1ccccc1)c1ccc2n(ncc2c1)-c1ccc(F)cc1 |r|
Show InChI InChI=1S/C27H30FN3O2S/c1-4-16-34(32,33)30-19-27(2,3)26(20-8-6-5-7-9-20)21-10-15-25-22(17-21)18-29-31(25)24-13-11-23(28)12-14-24/h5-15,17-18,26,30H,4,16,19H2,1-3H3/t26-/m0/s1
1.5n/an/an/an/an/an/an/an/a
Bristol-Myers Squibb Company
Curated by ChEMBL
Assay Description
Binding affinity to glucocorticoid receptor (unknown origin) by fluorescence assay
Bioorg Med Chem Lett 23: 5448-51 (2013)
Article DOI: 10.1016/j.bmcl.2013.06.085
BindingDB Entry DOI: 10.7270/Q22R3T2S
Glucocorticoid receptor
(Homo sapiens (Human))
BDBM50440103
(CHEMBL2426116)
Show SMILES CCCS(=O)(=O)NCC(C)(C)[C@@H](c1ccccc1)c1ccc2n(ncc2c1)-c1ccc(F)cc1 |r|
Show InChI InChI=1S/C27H30FN3O2S/c1-4-16-34(32,33)30-19-27(2,3)26(20-8-6-5-7-9-20)21-10-15-25-22(17-21)18-29-31(25)24-13-11-23(28)12-14-24/h5-15,17-18,26,30H,4,16,19H2,1-3H3/t26-/m0/s1
n/an/an/an/a 143n/an/an/an/a
Bristol-Myers Squibb Company
Curated by ChEMBL
Assay Description
Transrepression activity at glucocorticoid receptor in human A549 cells assessed as inhibition of PMA-stimulated AP1 response element by luciferase r...
Bioorg Med Chem Lett 23: 5448-51 (2013)
Article DOI: 10.1016/j.bmcl.2013.06.085
BindingDB Entry DOI: 10.7270/Q22R3T2S
Glucocorticoid receptor
(Homo sapiens (Human))
BDBM50440103
(CHEMBL2426116)
Show SMILES CCCS(=O)(=O)NCC(C)(C)[C@@H](c1ccccc1)c1ccc2n(ncc2c1)-c1ccc(F)cc1 |r|
Show InChI InChI=1S/C27H30FN3O2S/c1-4-16-34(32,33)30-19-27(2,3)26(20-8-6-5-7-9-20)21-10-15-25-22(17-21)18-29-31(25)24-13-11-23(28)12-14-24/h5-15,17-18,26,30H,4,16,19H2,1-3H3/t26-/m0/s1
n/an/an/an/a>1.00E+4n/an/an/an/a
Bristol-Myers Squibb Company
Curated by ChEMBL
Assay Description
Transactivation activity at glucocorticoid receptor ligand binding domain (unknown origin) expressed in human Hela cells co-expressing GAL4 DNA bindi...
Bioorg Med Chem Lett 23: 5448-51 (2013)
Article DOI: 10.1016/j.bmcl.2013.06.085
BindingDB Entry DOI: 10.7270/Q22R3T2S
Glucocorticoid receptor
(Homo sapiens (Human))
BDBM50440103
(CHEMBL2426116)
Show SMILES CCCS(=O)(=O)NCC(C)(C)[C@@H](c1ccccc1)c1ccc2n(ncc2c1)-c1ccc(F)cc1 |r|
Show InChI InChI=1S/C27H30FN3O2S/c1-4-16-34(32,33)30-19-27(2,3)26(20-8-6-5-7-9-20)21-10-15-25-22(17-21)18-29-31(25)24-13-11-23(28)12-14-24/h5-15,17-18,26,30H,4,16,19H2,1-3H3/t26-/m0/s1
n/an/an/an/a 86n/an/an/an/a
Bristol-Myers Squibb Company
Curated by ChEMBL
Assay Description
Transrepression activity at glucocorticoid receptor in human A549 cells assessed as inhibition of IL1beta-stimulated NFkappaB-dependent E-selectin tr...
Bioorg Med Chem Lett 23: 5448-51 (2013)
Article DOI: 10.1016/j.bmcl.2013.06.085
BindingDB Entry DOI: 10.7270/Q22R3T2S