BDBM50440104 CHEMBL2426115
SMILES: CCS(=O)(=O)NCC(C)(C)[C@@H](c1ccccc1)c1ccc2n(ncc2c1)-c1ccc(F)cc1
InChI Key: InChIKey=SCLCCJKVHBVHAT-VWLOTQADSA-N
Data: 1 KI  3 EC50
Activity Spreadsheet -- Enzyme Inhibition Constant Data from BindingDB
Found 4 hits for monomerid = 50440104
Trg + Lig
Ki
nM
ΔG°
kcal/mole
IC50
nM
Kd
nM
EC50/IC50
nM
koff
s-1
kon
M-1s-1
pHTemp
°C
Glucocorticoid receptor
(Homo sapiens (Human))
BDBM50440104
(CHEMBL2426115)
Show SMILES CCS(=O)(=O)NCC(C)(C)[C@@H](c1ccccc1)c1ccc2n(ncc2c1)-c1ccc(F)cc1 |r|
Show InChI InChI=1S/C26H28FN3O2S/c1-4-33(31,32)29-18-26(2,3)25(19-8-6-5-7-9-19)20-10-15-24-21(16-20)17-28-30(24)23-13-11-22(27)12-14-23/h5-17,25,29H,4,18H2,1-3H3/t25-/m0/s1
0.720n/an/an/an/an/an/an/an/a
Bristol-Myers Squibb Company
Curated by ChEMBL
Assay Description
Binding affinity to glucocorticoid receptor (unknown origin) by fluorescence assay
Bioorg Med Chem Lett 23: 5448-51 (2013)
Article DOI: 10.1016/j.bmcl.2013.06.085
BindingDB Entry DOI: 10.7270/Q22R3T2S
Glucocorticoid receptor
(Homo sapiens (Human))
BDBM50440104
(CHEMBL2426115)
Show SMILES CCS(=O)(=O)NCC(C)(C)[C@@H](c1ccccc1)c1ccc2n(ncc2c1)-c1ccc(F)cc1 |r|
Show InChI InChI=1S/C26H28FN3O2S/c1-4-33(31,32)29-18-26(2,3)25(19-8-6-5-7-9-19)20-10-15-24-21(16-20)17-28-30(24)23-13-11-22(27)12-14-23/h5-17,25,29H,4,18H2,1-3H3/t25-/m0/s1
n/an/an/an/a 29n/an/an/an/a
Bristol-Myers Squibb Company
Curated by ChEMBL
Assay Description
Transrepression activity at glucocorticoid receptor in human A549 cells assessed as inhibition of PMA-stimulated AP1 response element by luciferase r...
Bioorg Med Chem Lett 23: 5448-51 (2013)
Article DOI: 10.1016/j.bmcl.2013.06.085
BindingDB Entry DOI: 10.7270/Q22R3T2S
Glucocorticoid receptor
(Homo sapiens (Human))
BDBM50440104
(CHEMBL2426115)
Show SMILES CCS(=O)(=O)NCC(C)(C)[C@@H](c1ccccc1)c1ccc2n(ncc2c1)-c1ccc(F)cc1 |r|
Show InChI InChI=1S/C26H28FN3O2S/c1-4-33(31,32)29-18-26(2,3)25(19-8-6-5-7-9-19)20-10-15-24-21(16-20)17-28-30(24)23-13-11-22(27)12-14-23/h5-17,25,29H,4,18H2,1-3H3/t25-/m0/s1
n/an/an/an/a 214n/an/an/an/a
Bristol-Myers Squibb Company
Curated by ChEMBL
Assay Description
Transactivation activity at glucocorticoid receptor ligand binding domain (unknown origin) expressed in human Hela cells co-expressing GAL4 DNA bindi...
Bioorg Med Chem Lett 23: 5448-51 (2013)
Article DOI: 10.1016/j.bmcl.2013.06.085
BindingDB Entry DOI: 10.7270/Q22R3T2S
Glucocorticoid receptor
(Homo sapiens (Human))
BDBM50440104
(CHEMBL2426115)
Show SMILES CCS(=O)(=O)NCC(C)(C)[C@@H](c1ccccc1)c1ccc2n(ncc2c1)-c1ccc(F)cc1 |r|
Show InChI InChI=1S/C26H28FN3O2S/c1-4-33(31,32)29-18-26(2,3)25(19-8-6-5-7-9-19)20-10-15-24-21(16-20)17-28-30(24)23-13-11-22(27)12-14-23/h5-17,25,29H,4,18H2,1-3H3/t25-/m0/s1
n/an/an/an/a 16n/an/an/an/a
Bristol-Myers Squibb Company
Curated by ChEMBL
Assay Description
Transrepression activity at glucocorticoid receptor in human A549 cells assessed as inhibition of IL1beta-stimulated NFkappaB-dependent E-selectin tr...
Bioorg Med Chem Lett 23: 5448-51 (2013)
Article DOI: 10.1016/j.bmcl.2013.06.085
BindingDB Entry DOI: 10.7270/Q22R3T2S