BDBM50440110 CHEMBL2426128
SMILES: CC(C)C[C@@H](c1ccc2n(ncc2c1)-c1ccc(F)cc1)C(C)(C)CNC(=O)CC(F)(F)F
InChI Key: InChIKey=AQINTCRDTNJHQD-NRFANRHFSA-N
Data: 1 KI  3 EC50
Activity Spreadsheet -- Enzyme Inhibition Constant Data from BindingDB
Found 4 hits for monomerid = 50440110
Trg + Lig
Ki
nM
ΔG°
kcal/mole
IC50
nM
Kd
nM
EC50/IC50
nM
koff
s-1
kon
M-1s-1
pHTemp
°C
Glucocorticoid receptor
(Homo sapiens (Human))
BDBM50440110
(CHEMBL2426128)
Show SMILES CC(C)C[C@@H](c1ccc2n(ncc2c1)-c1ccc(F)cc1)C(C)(C)CNC(=O)CC(F)(F)F |r|
Show InChI InChI=1S/C25H29F4N3O/c1-16(2)11-21(24(3,4)15-30-23(33)13-25(27,28)29)17-5-10-22-18(12-17)14-31-32(22)20-8-6-19(26)7-9-20/h5-10,12,14,16,21H,11,13,15H2,1-4H3,(H,30,33)/t21-/m0/s1
1.30n/an/an/an/an/an/an/an/a
Bristol-Myers Squibb Company
Curated by ChEMBL
Assay Description
Binding affinity to glucocorticoid receptor (unknown origin) by fluorescence assay
Bioorg Med Chem Lett 23: 5448-51 (2013)
Article DOI: 10.1016/j.bmcl.2013.06.085
BindingDB Entry DOI: 10.7270/Q22R3T2S
Glucocorticoid receptor
(Homo sapiens (Human))
BDBM50440110
(CHEMBL2426128)
Show SMILES CC(C)C[C@@H](c1ccc2n(ncc2c1)-c1ccc(F)cc1)C(C)(C)CNC(=O)CC(F)(F)F |r|
Show InChI InChI=1S/C25H29F4N3O/c1-16(2)11-21(24(3,4)15-30-23(33)13-25(27,28)29)17-5-10-22-18(12-17)14-31-32(22)20-8-6-19(26)7-9-20/h5-10,12,14,16,21H,11,13,15H2,1-4H3,(H,30,33)/t21-/m0/s1
n/an/an/an/a 61n/an/an/an/a
Bristol-Myers Squibb Company
Curated by ChEMBL
Assay Description
Transrepression activity at glucocorticoid receptor in human A549 cells assessed as inhibition of PMA-stimulated AP1 response element by luciferase r...
Bioorg Med Chem Lett 23: 5448-51 (2013)
Article DOI: 10.1016/j.bmcl.2013.06.085
BindingDB Entry DOI: 10.7270/Q22R3T2S
Glucocorticoid receptor
(Homo sapiens (Human))
BDBM50440110
(CHEMBL2426128)
Show SMILES CC(C)C[C@@H](c1ccc2n(ncc2c1)-c1ccc(F)cc1)C(C)(C)CNC(=O)CC(F)(F)F |r|
Show InChI InChI=1S/C25H29F4N3O/c1-16(2)11-21(24(3,4)15-30-23(33)13-25(27,28)29)17-5-10-22-18(12-17)14-31-32(22)20-8-6-19(26)7-9-20/h5-10,12,14,16,21H,11,13,15H2,1-4H3,(H,30,33)/t21-/m0/s1
n/an/an/an/a 262n/an/an/an/a
Bristol-Myers Squibb Company
Curated by ChEMBL
Assay Description
Transactivation activity at glucocorticoid receptor ligand binding domain (unknown origin) expressed in human Hela cells co-expressing GAL4 DNA bindi...
Bioorg Med Chem Lett 23: 5448-51 (2013)
Article DOI: 10.1016/j.bmcl.2013.06.085
BindingDB Entry DOI: 10.7270/Q22R3T2S
Glucocorticoid receptor
(Homo sapiens (Human))
BDBM50440110
(CHEMBL2426128)
Show SMILES CC(C)C[C@@H](c1ccc2n(ncc2c1)-c1ccc(F)cc1)C(C)(C)CNC(=O)CC(F)(F)F |r|
Show InChI InChI=1S/C25H29F4N3O/c1-16(2)11-21(24(3,4)15-30-23(33)13-25(27,28)29)17-5-10-22-18(12-17)14-31-32(22)20-8-6-19(26)7-9-20/h5-10,12,14,16,21H,11,13,15H2,1-4H3,(H,30,33)/t21-/m0/s1
n/an/an/an/a 38n/an/an/an/a
Bristol-Myers Squibb Company
Curated by ChEMBL
Assay Description
Transrepression activity at glucocorticoid receptor in human A549 cells assessed as inhibition of IL1beta-stimulated NFkappaB-dependent E-selectin tr...
Bioorg Med Chem Lett 23: 5448-51 (2013)
Article DOI: 10.1016/j.bmcl.2013.06.085
BindingDB Entry DOI: 10.7270/Q22R3T2S