BDBM50440165 CHEMBL2424679
SMILES: COc1ccc(Br)cc1-c1nc(CSc2nc(N)cc(N)n2)cs1
InChI Key: InChIKey=IKCBJVKUSXOBCG-UHFFFAOYSA-N
Data: 1 IC50
Activity Spreadsheet -- Enzyme Inhibition Constant Data from BindingDB
Found 1 hit for monomerid = 50440165
Trg + Lig
Ki
nM
ΔG°
kcal/mole
IC50
nM
Kd
nM
EC50/IC50
nM
koff
s-1
kon
M-1s-1
pHTemp
°C
Deoxycytidine kinase
(Mus musculus)
BDBM50440165
(CHEMBL2424679)
Show SMILES COc1ccc(Br)cc1-c1nc(CSc2nc(N)cc(N)n2)cs1
Show InChI InChI=1S/C15H14BrN5OS2/c1-22-11-3-2-8(16)4-10(11)14-19-9(6-23-14)7-24-15-20-12(17)5-13(18)21-15/h2-6H,7H2,1H3,(H4,17,18,20,21)
Reactome pathway
n/an/a 1.76E+3n/an/an/an/an/an/a
California NanoSystems Institute
Curated by ChEMBL
Assay Description
Inhibition of dCK in mouse L1210 cells assessed as inhibition of tritiated deoxycytidine [3H]-dC uptake
J Med Chem 56: 6696-708 (2013)
Article DOI: 10.1021/jm400457y
BindingDB Entry DOI: 10.7270/Q2JS9RWP