BDBM50440244 CHEMBL2426660
SMILES: CC(C)(C(c1ccccc1)c1ccc2n(ncc2c1)-c1ccccc1)C(=O)Nc1nncs1
InChI Key: InChIKey=QNAOFOVNSXVXPJ-UHFFFAOYSA-N
Data: 1 KI  1 EC50
Activity Spreadsheet -- Enzyme Inhibition Constant Data from BindingDB
Found 2 hits for monomerid = 50440244
Trg + Lig
Ki
nM
ΔG°
kcal/mole
IC50
nM
Kd
nM
EC50/IC50
nM
koff
s-1
kon
M-1s-1
pHTemp
°C
Glucocorticoid receptor
(Homo sapiens (Human))
BDBM50440244
(CHEMBL2426660)
Show SMILES CC(C)(C(c1ccccc1)c1ccc2n(ncc2c1)-c1ccccc1)C(=O)Nc1nncs1
Show InChI InChI=1S/C26H23N5OS/c1-26(2,24(32)29-25-30-27-17-33-25)23(18-9-5-3-6-10-18)19-13-14-22-20(15-19)16-28-31(22)21-11-7-4-8-12-21/h3-17,23H,1-2H3,(H,29,30,32)
5n/an/an/an/an/an/an/an/a
Ironwood Pharmaceuticals
Curated by ChEMBL
Assay Description
Binding affinity to glucocorticoid receptor (unknown origin) by fluorescence polarization assay
Bioorg Med Chem Lett 23: 5442-7 (2013)
Article DOI: 10.1016/j.bmcl.2013.06.089
BindingDB Entry DOI: 10.7270/Q29888FB
Glucocorticoid receptor
(Homo sapiens (Human))
BDBM50440244
(CHEMBL2426660)
Show SMILES CC(C)(C(c1ccccc1)c1ccc2n(ncc2c1)-c1ccccc1)C(=O)Nc1nncs1
Show InChI InChI=1S/C26H23N5OS/c1-26(2,24(32)29-25-30-27-17-33-25)23(18-9-5-3-6-10-18)19-13-14-22-20(15-19)16-28-31(22)21-11-7-4-8-12-21/h3-17,23H,1-2H3,(H,29,30,32)
n/an/an/an/a 20n/an/an/an/a
Ironwood Pharmaceuticals
Curated by ChEMBL
Assay Description
Agonist activity at glucocorticoid receptor in human A549 cells assessed as inhibition of PMA-induced AP-1 activation by luciferase reporter gene ass...
Bioorg Med Chem Lett 23: 5442-7 (2013)
Article DOI: 10.1016/j.bmcl.2013.06.089
BindingDB Entry DOI: 10.7270/Q29888FB