BDBM50440273 CHEMBL2426749
SMILES: COc1ccc(cc1)C(\CO)=C/c1cc(OC)cc(OC)c1
InChI Key: InChIKey=LYFYYDWZXHECEM-NVNXTCNLSA-N
Data: 1 IC50
Activity Spreadsheet -- Enzyme Inhibition Constant Data from BindingDB
Found 1 hit for monomerid = 50440273
Trg + Lig
Ki
nM
ΔG°
kcal/mole
IC50
nM
Kd
nM
EC50/IC50
nM
koff
s-1
kon
M-1s-1
pHTemp
°C
Ribosyldihydronicotinamide dehydrogenase [quinone]
(Homo sapiens (Human))
BDBM50440273
(CHEMBL2426749)
Show SMILES COc1ccc(cc1)C(\CO)=C/c1cc(OC)cc(OC)c1
Show InChI InChI=1S/C18H20O4/c1-20-16-6-4-14(5-7-16)15(12-19)8-13-9-17(21-2)11-18(10-13)22-3/h4-11,19H,12H2,1-3H3/b15-8-
n/an/a 2.75E+4n/an/an/an/an/an/a
Purdue University
Curated by ChEMBL
Assay Description
Inhibition of human quinone reductase 2 expressed in Escherichia coli BL21(DE3) using N-methyldihydronicotinamide as co-substrate
Bioorg Med Chem 21: 6022-37 (2013)
Article DOI: 10.1016/j.bmc.2013.07.037
BindingDB Entry DOI: 10.7270/Q21R6RX0