BDBM50440278 CHEMBL2426744
SMILES: Oc1ccc(cc1)C(=C\c1cc(O)cc(O)c1)\C#N
InChI Key: InChIKey=DJTHKTZFMKRXGU-LFYBBSHMSA-N
Data: 1 IC50
Activity Spreadsheet -- Enzyme Inhibition Constant Data from BindingDB
Found 1 hit for monomerid = 50440278
Trg + Lig
Ki
nM
ΔG°
kcal/mole
IC50
nM
Kd
nM
EC50/IC50
nM
koff
s-1
kon
M-1s-1
pHTemp
°C
Ribosyldihydronicotinamide dehydrogenase [quinone]
(Homo sapiens (Human))
BDBM50440278
(CHEMBL2426744)
Show SMILES Oc1ccc(cc1)C(=C\c1cc(O)cc(O)c1)\C#N
Show InChI InChI=1S/C15H11NO3/c16-9-12(11-1-3-13(17)4-2-11)5-10-6-14(18)8-15(19)7-10/h1-8,17-19H/b12-5+
n/an/a 5.90E+3n/an/an/an/an/an/a
Purdue University
Curated by ChEMBL
Assay Description
Inhibition of human quinone reductase 2 expressed in Escherichia coli BL21(DE3) using N-methyldihydronicotinamide as co-substrate
Bioorg Med Chem 21: 6022-37 (2013)
Article DOI: 10.1016/j.bmc.2013.07.037
BindingDB Entry DOI: 10.7270/Q21R6RX0