BDBM50440302 CHEMBL2424877
SMILES: COc1ccc2ncc(F)c([C@@H](O)[C@H](O)[C@@H]3CC[C@H](CO3)NCc3cc4SCCOc4cn3)c2n1
InChI Key: InChIKey=DRXUTILJOGAOMV-LHGREFERSA-N
Data: 2 IC50
Activity Spreadsheet -- Enzyme Inhibition Constant Data from BindingDB
Found 2 hits for monomerid = 50440302
Trg + Lig
Ki
nM
ΔG°
kcal/mole
IC50
nM
Kd
nM
EC50/IC50
nM
koff
s-1
kon
M-1s-1
pHTemp
°C
DNA Gyrase
(Staphylococcus aureus)
BDBM50440302
(CHEMBL2424877)
Show SMILES COc1ccc2ncc(F)c([C@@H](O)[C@H](O)[C@@H]3CC[C@H](CO3)NCc3cc4SCCOc4cn3)c2n1 |r|
Show InChI InChI=1S/C24H27FN4O5S/c1-32-20-5-3-16-22(29-20)21(15(25)10-28-16)24(31)23(30)17-4-2-13(12-34-17)26-9-14-8-19-18(11-27-14)33-6-7-35-19/h3,5,8,10-11,13,17,23-24,26,30-31H,2,4,6-7,9,12H2,1H3/t13-,17+,23-,24-/m1/s1
n/an/a 30n/an/an/an/an/an/a
Actelion Pharmaceuticals Ltd
Curated by ChEMBL
Assay Description
Inhibition of wild type Staphylococcus aureus DNA gyrase subunit 2GyrA/2GyrB assessed as pBR322 supercoiling after 1 hr
J Med Chem 56: 7396-415 (2013)
Article DOI: 10.1021/jm400963y
BindingDB Entry DOI: 10.7270/Q2HT2QRV
Topoisomerase IV
(Staphylococcus aureus)
BDBM50440302
(CHEMBL2424877)
Show SMILES COc1ccc2ncc(F)c([C@@H](O)[C@H](O)[C@@H]3CC[C@H](CO3)NCc3cc4SCCOc4cn3)c2n1 |r|
Show InChI InChI=1S/C24H27FN4O5S/c1-32-20-5-3-16-22(29-20)21(15(25)10-28-16)24(31)23(30)17-4-2-13(12-34-17)26-9-14-8-19-18(11-27-14)33-6-7-35-19/h3,5,8,10-11,13,17,23-24,26,30-31H,2,4,6-7,9,12H2,1H3/t13-,17+,23-,24-/m1/s1
n/an/a 8.00E+3n/an/an/an/an/an/a
Actelion Pharmaceuticals Ltd
Curated by ChEMBL
Assay Description
Inhibition of wild type Staphylococcus aureus ATCC 29213 topoisomerase-4 subunit 2GrlA/2GrlB assessed as pBR322 relaxation after 1 hr
J Med Chem 56: 7396-415 (2013)
Article DOI: 10.1021/jm400963y
BindingDB Entry DOI: 10.7270/Q2HT2QRV