null
SMILES: Cc1ccc(cc1)-n1nc(cc1NC(=O)Nc1ccc(cc1)-c1csnn1)C(C)(C)C
InChI Key: InChIKey=IRSCZNCGMYWXAY-UHFFFAOYSA-N
Activity Spreadsheet -- Enzyme Inhibition Constant Data from BindingDB
Found 7 hits for monomerid = 50440363
Trg + Lig
Ki
nM
ΔG°
kcal/mole
IC50
nM
Kd
nM
EC50/IC50
nM
koff
s-1
kon
M-1s-1
pHTemp
°C
Cytochrome P450 2D6
(Homo sapiens (Human))
BDBM50440363
(CHEMBL2425151)
Show SMILES Cc1ccc(cc1)-n1nc(cc1NC(=O)Nc1ccc(cc1)-c1csnn1)C(C)(C)C
Show InChI InChI=1S/C23H24N6OS/c1-15-5-11-18(12-6-15)29-21(13-20(27-29)23(2,3)4)25-22(30)24-17-9-7-16(8-10-17)19-14-31-28-26-19/h5-14H,1-4H3,(H2,24,25,30)
n/an/a>1.00E+4n/an/an/an/an/an/a
Merck KGaA
Curated by ChEMBL
Assay Description
Inhibition of CYP2D6 (unknown origin)
Bioorg Med Chem Lett 23: 5401-9 (2013)
Article DOI: 10.1016/j.bmcl.2013.07.050
BindingDB Entry DOI: 10.7270/Q2891782
Cytochrome P450 2C19
(Homo sapiens (Human))
BDBM50440363
(CHEMBL2425151)
Show SMILES Cc1ccc(cc1)-n1nc(cc1NC(=O)Nc1ccc(cc1)-c1csnn1)C(C)(C)C
Show InChI InChI=1S/C23H24N6OS/c1-15-5-11-18(12-6-15)29-21(13-20(27-29)23(2,3)4)25-22(30)24-17-9-7-16(8-10-17)19-14-31-28-26-19/h5-14H,1-4H3,(H2,24,25,30)
Reactome pathway
n/an/a>1.00E+4n/an/an/an/an/an/a
Merck KGaA
Curated by ChEMBL
Assay Description
Inhibition of CYP2C19 (unknown origin)
Bioorg Med Chem Lett 23: 5401-9 (2013)
Article DOI: 10.1016/j.bmcl.2013.07.050
BindingDB Entry DOI: 10.7270/Q2891782
Cytochrome P450 2C9
(Homo sapiens (Human))
BDBM50440363
(CHEMBL2425151)
Show SMILES Cc1ccc(cc1)-n1nc(cc1NC(=O)Nc1ccc(cc1)-c1csnn1)C(C)(C)C
Show InChI InChI=1S/C23H24N6OS/c1-15-5-11-18(12-6-15)29-21(13-20(27-29)23(2,3)4)25-22(30)24-17-9-7-16(8-10-17)19-14-31-28-26-19/h5-14H,1-4H3,(H2,24,25,30)
Reactome pathway
n/an/a>1.00E+4n/an/an/an/an/an/a
Merck KGaA
Curated by ChEMBL
Assay Description
Inhibition of CYP2C9 (unknown origin)
Bioorg Med Chem Lett 23: 5401-9 (2013)
Article DOI: 10.1016/j.bmcl.2013.07.050
BindingDB Entry DOI: 10.7270/Q2891782
Focal adhesion kinase 1
(Homo sapiens (Human))
BDBM50440363
(CHEMBL2425151)
Show SMILES Cc1ccc(cc1)-n1nc(cc1NC(=O)Nc1ccc(cc1)-c1csnn1)C(C)(C)C
Show InChI InChI=1S/C23H24N6OS/c1-15-5-11-18(12-6-15)29-21(13-20(27-29)23(2,3)4)25-22(30)24-17-9-7-16(8-10-17)19-14-31-28-26-19/h5-14H,1-4H3,(H2,24,25,30)
NCI pathway
Reactome pathway
n/an/an/a 1.08E+4n/an/an/an/an/a
Merck KGaA
Curated by ChEMBL
Assay Description
Binding affinity to FAK kinase (unknown origin) by surface plasmon resonance assay
Bioorg Med Chem Lett 23: 5401-9 (2013)
Article DOI: 10.1016/j.bmcl.2013.07.050
BindingDB Entry DOI: 10.7270/Q2891782
Cytochrome P450 1A2
(Homo sapiens (Human))
BDBM50440363
(CHEMBL2425151)
Show SMILES Cc1ccc(cc1)-n1nc(cc1NC(=O)Nc1ccc(cc1)-c1csnn1)C(C)(C)C
Show InChI InChI=1S/C23H24N6OS/c1-15-5-11-18(12-6-15)29-21(13-20(27-29)23(2,3)4)25-22(30)24-17-9-7-16(8-10-17)19-14-31-28-26-19/h5-14H,1-4H3,(H2,24,25,30)
Reactome pathway
n/an/a>1.00E+4n/an/an/an/an/an/a
Merck KGaA
Curated by ChEMBL
Assay Description
Inhibition of CYP1A2 (unknown origin)
Bioorg Med Chem Lett 23: 5401-9 (2013)
Article DOI: 10.1016/j.bmcl.2013.07.050
BindingDB Entry DOI: 10.7270/Q2891782
Focal adhesion kinase 1
(Homo sapiens (Human))
BDBM50440363
(CHEMBL2425151)
Show SMILES Cc1ccc(cc1)-n1nc(cc1NC(=O)Nc1ccc(cc1)-c1csnn1)C(C)(C)C
Show InChI InChI=1S/C23H24N6OS/c1-15-5-11-18(12-6-15)29-21(13-20(27-29)23(2,3)4)25-22(30)24-17-9-7-16(8-10-17)19-14-31-28-26-19/h5-14H,1-4H3,(H2,24,25,30)
NCI pathway
Reactome pathway
n/an/a>1.00E+4n/an/an/an/an/an/a
Merck KGaA
Curated by ChEMBL
Assay Description
Inhibition of FAK (unknown origin) using biotinylated-His-TEVhsFAK(31-686)(K454R) as substrate after 2 hrs by scintillation counting analysis
Bioorg Med Chem Lett 23: 5401-9 (2013)
Article DOI: 10.1016/j.bmcl.2013.07.050
BindingDB Entry DOI: 10.7270/Q2891782
Cytochrome P450 2C8
(Homo sapiens (Human))
BDBM50440363
(CHEMBL2425151)
Show SMILES Cc1ccc(cc1)-n1nc(cc1NC(=O)Nc1ccc(cc1)-c1csnn1)C(C)(C)C
Show InChI InChI=1S/C23H24N6OS/c1-15-5-11-18(12-6-15)29-21(13-20(27-29)23(2,3)4)25-22(30)24-17-9-7-16(8-10-17)19-14-31-28-26-19/h5-14H,1-4H3,(H2,24,25,30)
n/an/a>1.00E+4n/an/an/an/an/an/a
Merck KGaA
Curated by ChEMBL
Assay Description
Inhibition of CYP2C8 (unknown origin)
Bioorg Med Chem Lett 23: 5401-9 (2013)
Article DOI: 10.1016/j.bmcl.2013.07.050
BindingDB Entry DOI: 10.7270/Q2891782