BDBM50440495 CHEMBL2426149
SMILES: CC(C)(C(c1ccccc1)c1ccc2c(ncn2c1)-c1ccc(F)c(Cl)c1)C(=O)Nc1nncs1
InChI Key: InChIKey=MLFLJTCNQJZMTR-UHFFFAOYSA-N
Data: 1 KI  2 EC50
Activity Spreadsheet -- Enzyme Inhibition Constant Data from BindingDB
Found 3 hits for monomerid = 50440495
Trg + Lig
Ki
nM
ΔG°
kcal/mole
IC50
nM
Kd
nM
EC50/IC50
nM
koff
s-1
kon
M-1s-1
pHTemp
°C
Glucocorticoid receptor
(Homo sapiens (Human))
BDBM50440495
(CHEMBL2426149)
Show SMILES CC(C)(C(c1ccccc1)c1ccc2c(ncn2c1)-c1ccc(F)c(Cl)c1)C(=O)Nc1nncs1
Show InChI InChI=1S/C26H21ClFN5OS/c1-26(2,24(34)31-25-32-30-15-35-25)22(16-6-4-3-5-7-16)18-9-11-21-23(29-14-33(21)13-18)17-8-10-20(28)19(27)12-17/h3-15,22H,1-2H3,(H,31,32,34)
5n/an/an/an/an/an/an/an/a
Bristol-Myers Squibb Company
Curated by ChEMBL
Assay Description
Binding affinity to glucocorticoid receptor-LBD (unknown origin) by fluorescence polarization assay
Bioorg Med Chem Lett 23: 5571-4 (2013)
Article DOI: 10.1016/j.bmcl.2013.08.049
BindingDB Entry DOI: 10.7270/Q2QC04Z4
Glucocorticoid receptor
(Homo sapiens (Human))
BDBM50440495
(CHEMBL2426149)
Show SMILES CC(C)(C(c1ccccc1)c1ccc2c(ncn2c1)-c1ccc(F)c(Cl)c1)C(=O)Nc1nncs1
Show InChI InChI=1S/C26H21ClFN5OS/c1-26(2,24(34)31-25-32-30-15-35-25)22(16-6-4-3-5-7-16)18-9-11-21-23(29-14-33(21)13-18)17-8-10-20(28)19(27)12-17/h3-15,22H,1-2H3,(H,31,32,34)
n/an/an/an/a>1.00E+4n/an/an/an/a
Bristol-Myers Squibb Company
Curated by ChEMBL
Assay Description
Transactivation of GR-LBD expressed in human HeLa cells co-expressing GAL4-DBD by luciferase reporter gene assay
Bioorg Med Chem Lett 23: 5571-4 (2013)
Article DOI: 10.1016/j.bmcl.2013.08.049
BindingDB Entry DOI: 10.7270/Q2QC04Z4
Glucocorticoid receptor
(Homo sapiens (Human))
BDBM50440495
(CHEMBL2426149)
Show SMILES CC(C)(C(c1ccccc1)c1ccc2c(ncn2c1)-c1ccc(F)c(Cl)c1)C(=O)Nc1nncs1
Show InChI InChI=1S/C26H21ClFN5OS/c1-26(2,24(34)31-25-32-30-15-35-25)22(16-6-4-3-5-7-16)18-9-11-21-23(29-14-33(21)13-18)17-8-10-20(28)19(27)12-17/h3-15,22H,1-2H3,(H,31,32,34)
n/an/an/an/a 111n/an/an/an/a
Bristol-Myers Squibb Company
Curated by ChEMBL
Assay Description
Transrepression of glucocorticoid receptor in human A549 cells assessed as inhibition of PMA-induced AP-1 activity by luciferase reporter gene assay
Bioorg Med Chem Lett 23: 5571-4 (2013)
Article DOI: 10.1016/j.bmcl.2013.08.049
BindingDB Entry DOI: 10.7270/Q2QC04Z4