BDBM50440496 CHEMBL2426145
SMILES: CC(C)(C(c1ccccc1)c1ccc2c(ncn2c1)-c1cccc(CO)c1)C(=O)Nc1nncs1
InChI Key: InChIKey=WLKMHVZIDHRVCH-UHFFFAOYSA-N
Data: 1 KI  2 EC50
Activity Spreadsheet -- Enzyme Inhibition Constant Data from BindingDB
Found 3 hits for monomerid = 50440496
Trg + Lig
Ki
nM
ΔG°
kcal/mole
IC50
nM
Kd
nM
EC50/IC50
nM
koff
s-1
kon
M-1s-1
pHTemp
°C
Glucocorticoid receptor
(Homo sapiens (Human))
BDBM50440496
(CHEMBL2426145)
Show SMILES CC(C)(C(c1ccccc1)c1ccc2c(ncn2c1)-c1cccc(CO)c1)C(=O)Nc1nncs1
Show InChI InChI=1S/C27H25N5O2S/c1-27(2,25(34)30-26-31-29-17-35-26)23(19-8-4-3-5-9-19)21-11-12-22-24(28-16-32(22)14-21)20-10-6-7-18(13-20)15-33/h3-14,16-17,23,33H,15H2,1-2H3,(H,30,31,34)
5n/an/an/an/an/an/an/an/a
Bristol-Myers Squibb Company
Curated by ChEMBL
Assay Description
Binding affinity to glucocorticoid receptor-LBD (unknown origin) by fluorescence polarization assay
Bioorg Med Chem Lett 23: 5571-4 (2013)
Article DOI: 10.1016/j.bmcl.2013.08.049
BindingDB Entry DOI: 10.7270/Q2QC04Z4
Glucocorticoid receptor
(Homo sapiens (Human))
BDBM50440496
(CHEMBL2426145)
Show SMILES CC(C)(C(c1ccccc1)c1ccc2c(ncn2c1)-c1cccc(CO)c1)C(=O)Nc1nncs1
Show InChI InChI=1S/C27H25N5O2S/c1-27(2,25(34)30-26-31-29-17-35-26)23(19-8-4-3-5-9-19)21-11-12-22-24(28-16-32(22)14-21)20-10-6-7-18(13-20)15-33/h3-14,16-17,23,33H,15H2,1-2H3,(H,30,31,34)
n/an/an/an/a>1.00E+4n/an/an/an/a
Bristol-Myers Squibb Company
Curated by ChEMBL
Assay Description
Transactivation of GR-LBD expressed in human HeLa cells co-expressing GAL4-DBD by luciferase reporter gene assay
Bioorg Med Chem Lett 23: 5571-4 (2013)
Article DOI: 10.1016/j.bmcl.2013.08.049
BindingDB Entry DOI: 10.7270/Q2QC04Z4
Glucocorticoid receptor
(Homo sapiens (Human))
BDBM50440496
(CHEMBL2426145)
Show SMILES CC(C)(C(c1ccccc1)c1ccc2c(ncn2c1)-c1cccc(CO)c1)C(=O)Nc1nncs1
Show InChI InChI=1S/C27H25N5O2S/c1-27(2,25(34)30-26-31-29-17-35-26)23(19-8-4-3-5-9-19)21-11-12-22-24(28-16-32(22)14-21)20-10-6-7-18(13-20)15-33/h3-14,16-17,23,33H,15H2,1-2H3,(H,30,31,34)
n/an/an/an/a>5.00E+3n/an/an/an/a
Bristol-Myers Squibb Company
Curated by ChEMBL
Assay Description
Transrepression of glucocorticoid receptor in human A549 cells assessed as inhibition of PMA-induced AP-1 activity by luciferase reporter gene assay
Bioorg Med Chem Lett 23: 5571-4 (2013)
Article DOI: 10.1016/j.bmcl.2013.08.049
BindingDB Entry DOI: 10.7270/Q2QC04Z4