BDBM50440506 CHEMBL2426200
SMILES: Clc1ccc(NC(=O)Nc2nnc(s2)-c2cccnc2)cc1Cl
InChI Key: InChIKey=NDDFZBKJVUZTAQ-UHFFFAOYSA-N
Data: 1 IC50
Activity Spreadsheet -- Enzyme Inhibition Constant Data from BindingDB
Found 1 hit for monomerid = 50440506
Trg + Lig
Ki
nM
ΔG°
kcal/mole
IC50
nM
Kd
nM
EC50/IC50
nM
koff
s-1
kon
M-1s-1
pHTemp
°C
Bloom syndrome protein
(Homo sapiens (Human))
BDBM50440506
(CHEMBL2426200)
Show SMILES Clc1ccc(NC(=O)Nc2nnc(s2)-c2cccnc2)cc1Cl
Show InChI InChI=1S/C14H9Cl2N5OS/c15-10-4-3-9(6-11(10)16)18-13(22)19-14-21-20-12(23-14)8-2-1-5-17-7-8/h1-7H,(H2,18,19,21,22)
Reactome pathway
n/an/a 3.50E+3n/an/an/an/an/an/a
National Center for Advancing Translational Sciences
Curated by ChEMBL
Assay Description
Inhibition of BLM (unknown origin) by gel-based DNA unwinding assay
Bioorg Med Chem Lett 23: 5660-6 (2013)
Checked by Author
Article DOI: 10.1016/j.bmcl.2013.08.025
BindingDB Entry DOI: 10.7270/Q2KK9D78