BDBM50440517 CHEMBL2426193
SMILES: [O-][N+](=O)c1cc(NC(=O)Nc2nnc(s2)-c2ccncc2)ccc1Cl
InChI Key: InChIKey=JPHGPQCCVGFNHJ-UHFFFAOYSA-N
Data: 1 IC50
Activity Spreadsheet -- Enzyme Inhibition Constant Data from BindingDB
Found 1 hit for monomerid = 50440517
Trg + Lig
Ki
nM
ΔG°
kcal/mole
IC50
nM
Kd
nM
EC50/IC50
nM
koff
s-1
kon
M-1s-1
pHTemp
°C
Bloom syndrome protein
(Homo sapiens (Human))
BDBM50440517
(CHEMBL2426193)
Show SMILES [O-][N+](=O)c1cc(NC(=O)Nc2nnc(s2)-c2ccncc2)ccc1Cl
Show InChI InChI=1S/C14H9ClN6O3S/c15-10-2-1-9(7-11(10)21(23)24)17-13(22)18-14-20-19-12(25-14)8-3-5-16-6-4-8/h1-7H,(H2,17,18,20,22)
Reactome pathway
n/an/a 1.30E+3n/an/an/an/an/an/a
National Center for Advancing Translational Sciences
Curated by ChEMBL
Assay Description
Inhibition of BLM (unknown origin) by gel-based DNA unwinding assay
Bioorg Med Chem Lett 23: 5660-6 (2013)
Checked by Author
Article DOI: 10.1016/j.bmcl.2013.08.025
BindingDB Entry DOI: 10.7270/Q2KK9D78