BDBM50440521 CHEMBL2426197
SMILES: O=C(Nc1nnc(s1)-c1ccncc1)Nc1cccc(c1)C#N
InChI Key: InChIKey=PNAWKMZKOVQRAI-UHFFFAOYSA-N
Data: 1 IC50
Activity Spreadsheet -- Enzyme Inhibition Constant Data from BindingDB
Found 1 hit for monomerid = 50440521
Trg + Lig
Ki
nM
ΔG°
kcal/mole
IC50
nM
Kd
nM
EC50/IC50
nM
koff
s-1
kon
M-1s-1
pHTemp
°C
Bloom syndrome protein
(Homo sapiens (Human))
BDBM50440521
(CHEMBL2426197)
Show SMILES O=C(Nc1nnc(s1)-c1ccncc1)Nc1cccc(c1)C#N
Show InChI InChI=1S/C15H10N6OS/c16-9-10-2-1-3-12(8-10)18-14(22)19-15-21-20-13(23-15)11-4-6-17-7-5-11/h1-8H,(H2,18,19,21,22)
Reactome pathway
n/an/a 8.90E+3n/an/an/an/an/an/a
National Center for Advancing Translational Sciences
Curated by ChEMBL
Assay Description
Inhibition of BLM (unknown origin) by gel-based DNA unwinding assay
Bioorg Med Chem Lett 23: 5660-6 (2013)
Checked by Author
Article DOI: 10.1016/j.bmcl.2013.08.025
BindingDB Entry DOI: 10.7270/Q2KK9D78