BDBM50440523 CHEMBL2426160
SMILES: FC(F)(F)c1cc(NC(=O)Nc2nnc(s2)-c2ccncc2)ccc1C#N
InChI Key: InChIKey=FYLJELZXZRXGQC-UHFFFAOYSA-N
Data: 1 IC50
Activity Spreadsheet -- Enzyme Inhibition Constant Data from BindingDB
Found 1 hit for monomerid = 50440523
Trg + Lig
Ki
nM
ΔG°
kcal/mole
IC50
nM
Kd
nM
EC50/IC50
nM
koff
s-1
kon
M-1s-1
pHTemp
°C
Bloom syndrome protein
(Homo sapiens (Human))
BDBM50440523
(CHEMBL2426160)
Show SMILES FC(F)(F)c1cc(NC(=O)Nc2nnc(s2)-c2ccncc2)ccc1C#N
Show InChI InChI=1S/C16H9F3N6OS/c17-16(18,19)12-7-11(2-1-10(12)8-20)22-14(26)23-15-25-24-13(27-15)9-3-5-21-6-4-9/h1-7H,(H2,22,23,25,26)
Reactome pathway
n/an/a 5.60E+3n/an/an/an/an/an/a
National Center for Advancing Translational Sciences
Curated by ChEMBL
Assay Description
Inhibition of BLM (unknown origin) by gel-based DNA unwinding assay
Bioorg Med Chem Lett 23: 5660-6 (2013)
Checked by Author
Article DOI: 10.1016/j.bmcl.2013.08.025
BindingDB Entry DOI: 10.7270/Q2KK9D78