BDBM50440895 CHEMBL2431825
SMILES: C[C@H](c1nnc2ccc(nn12)-c1cccc(C)c1)c1ccc2ncccc2c1
InChI Key: InChIKey=HVLIYQXRRXBLOC-INIZCTEOSA-N
Data: 1 KI  1 IC50
Activity Spreadsheet -- Enzyme Inhibition Constant Data from BindingDB
Found 2 hits for monomerid = 50440895
Trg + Lig
Ki
nM
ΔG°
kcal/mole
IC50
nM
Kd
nM
EC50/IC50
nM
koff
s-1
kon
M-1s-1
pHTemp
°C
Hepatocyte growth factor receptor
(Homo sapiens (Human))
BDBM50440895
(CHEMBL2431825)
Show SMILES C[C@H](c1nnc2ccc(nn12)-c1cccc(C)c1)c1ccc2ncccc2c1 |r|
Show InChI InChI=1S/C23H19N5/c1-15-5-3-6-18(13-15)21-10-11-22-25-26-23(28(22)27-21)16(2)17-8-9-20-19(14-17)7-4-12-24-20/h3-14,16H,1-2H3/t16-/m0/s1
5n/an/an/an/an/an/an/an/a
Pfizer Inc.
Curated by ChEMBL
Assay Description
Inhibition of N-terminal His-6-tagged human recombinant c-Met (974 to 1390) using Ac-ARDMYDKEYYSVHNK as substrate by spectrophotometric assay
J Med Chem 56: 6651-65 (2013)
Article DOI: 10.1021/jm400926x
BindingDB Entry DOI: 10.7270/Q2HM59WR
Hepatocyte growth factor receptor
(Homo sapiens (Human))
BDBM50440895
(CHEMBL2431825)
Show SMILES C[C@H](c1nnc2ccc(nn12)-c1cccc(C)c1)c1ccc2ncccc2c1 |r|
Show InChI InChI=1S/C23H19N5/c1-15-5-3-6-18(13-15)21-10-11-22-25-26-23(28(22)27-21)16(2)17-8-9-20-19(14-17)7-4-12-24-20/h3-14,16H,1-2H3/t16-/m0/s1
n/an/a 11n/an/an/an/an/an/a
Pfizer Inc.
Curated by ChEMBL
Assay Description
Inhibition of c-Met autophosphorylation in human A549 cells after 1 hr by ELISA
J Med Chem 56: 6651-65 (2013)
Article DOI: 10.1021/jm400926x
BindingDB Entry DOI: 10.7270/Q2HM59WR