BDBM50440896 CHEMBL2431826
SMILES: C[C@H](c1nnc2ccc(nn12)-c1cccc(c1)C#N)c1ccc2ncccc2c1
InChI Key: InChIKey=QRWHTFXNHZLJAL-HNNXBMFYSA-N
Data: 1 KI  1 IC50
Activity Spreadsheet -- Enzyme Inhibition Constant Data from BindingDB
Found 2 hits for monomerid = 50440896
Trg + Lig
Ki
nM
ΔG°
kcal/mole
IC50
nM
Kd
nM
EC50/IC50
nM
koff
s-1
kon
M-1s-1
pHTemp
°C
Hepatocyte growth factor receptor
(Homo sapiens (Human))
BDBM50440896
(CHEMBL2431826)
Show SMILES C[C@H](c1nnc2ccc(nn12)-c1cccc(c1)C#N)c1ccc2ncccc2c1 |r|
Show InChI InChI=1S/C23H16N6/c1-15(17-7-8-20-19(13-17)6-3-11-25-20)23-27-26-22-10-9-21(28-29(22)23)18-5-2-4-16(12-18)14-24/h2-13,15H,1H3/t15-/m0/s1
4n/an/an/an/an/an/an/an/a
Pfizer Inc.
Curated by ChEMBL
Assay Description
Inhibition of N-terminal His-6-tagged human recombinant c-Met (974 to 1390) using Ac-ARDMYDKEYYSVHNK as substrate by spectrophotometric assay
J Med Chem 56: 6651-65 (2013)
Article DOI: 10.1021/jm400926x
BindingDB Entry DOI: 10.7270/Q2HM59WR
Hepatocyte growth factor receptor
(Homo sapiens (Human))
BDBM50440896
(CHEMBL2431826)
Show SMILES C[C@H](c1nnc2ccc(nn12)-c1cccc(c1)C#N)c1ccc2ncccc2c1 |r|
Show InChI InChI=1S/C23H16N6/c1-15(17-7-8-20-19(13-17)6-3-11-25-20)23-27-26-22-10-9-21(28-29(22)23)18-5-2-4-16(12-18)14-24/h2-13,15H,1H3/t15-/m0/s1
n/an/a 4n/an/an/an/an/an/a
Pfizer Inc.
Curated by ChEMBL
Assay Description
Inhibition of c-Met autophosphorylation in human A549 cells after 1 hr by ELISA
J Med Chem 56: 6651-65 (2013)
Article DOI: 10.1021/jm400926x
BindingDB Entry DOI: 10.7270/Q2HM59WR