BDBM50441426 CHEMBL2436275
SMILES: Fc1ccc(Cn2c(CN3CCCC3)nc3ccccc23)cc1
InChI Key: InChIKey=OYSHGKLBFYCLSK-UHFFFAOYSA-N
Data: 2 IC50
Activity Spreadsheet -- Enzyme Inhibition Constant Data from BindingDB
Found 2 hits for monomerid = 50441426
Trg + Lig
Ki
nM
ΔG°
kcal/mole
IC50
nM
Kd
nM
EC50/IC50
nM
koff
s-1
kon
M-1s-1
pHTemp
°C
Heme Oxygenase 2 (HO-2)
(Rattus norvegicus (rat))
BDBM50441426
(CHEMBL2436275)
Show SMILES Fc1ccc(Cn2c(CN3CCCC3)nc3ccccc23)cc1
Show InChI InChI=1S/C19H20FN3/c20-16-9-7-15(8-10-16)13-23-18-6-2-1-5-17(18)21-19(23)14-22-11-3-4-12-22/h1-2,5-10H,3-4,11-14H2
Reactome pathway
n/an/a 2.00E+3n/an/an/an/an/an/a
Queen's University
Curated by ChEMBL
Assay Description
Inhibition of HO-2 in Sprague-Dawley rat brain microsomal fractions assessed as carbon monoxide formation from methemalbumin after 10 mins by gas chr...
Bioorg Med Chem 21: 6788-95 (2013)
Article DOI: 10.1016/j.bmc.2013.07.050
BindingDB Entry DOI: 10.7270/Q27082VV
Heme Oxygenase 1 (HO-1)
(Rattus norvegicus (rat))
BDBM50441426
(CHEMBL2436275)
Show SMILES Fc1ccc(Cn2c(CN3CCCC3)nc3ccccc23)cc1
Show InChI InChI=1S/C19H20FN3/c20-16-9-7-15(8-10-16)13-23-18-6-2-1-5-17(18)21-19(23)14-22-11-3-4-12-22/h1-2,5-10H,3-4,11-14H2
Reactome pathway
n/an/a>1.00E+5n/an/an/an/an/an/a
Queen's University
Curated by ChEMBL
Assay Description
Inhibition of HO-1 in Sprague-Dawley rat spleen microsomal fractions assessed as carbon monoxide formation from methemalbumin after 10 mins by gas ch...
Bioorg Med Chem 21: 6788-95 (2013)
Article DOI: 10.1016/j.bmc.2013.07.050
BindingDB Entry DOI: 10.7270/Q27082VV