BDBM50441486 CHEMBL2436593
SMILES: Oc1cccc(CCC(=O)N2CCC3(CCN(C3)C(=O)Nc3ccc(OC(F)(F)F)cc3)CC2)c1
InChI Key: InChIKey=QHHSOTCAOZUTOG-UHFFFAOYSA-N
Data: 2 IC50
Activity Spreadsheet -- Enzyme Inhibition Constant Data from BindingDB
Found 2 hits for monomerid = 50441486
Trg + Lig
Ki
nM
ΔG°
kcal/mole
IC50
nM
Kd
nM
EC50/IC50
nM
koff
s-1
kon
M-1s-1
pHTemp
°C
EBifunctional epoxide hydrolase 2
(Homo sapiens (Human))
BDBM50441486
(CHEMBL2436593)
Show SMILES Oc1cccc(CCC(=O)N2CCC3(CCN(C3)C(=O)Nc3ccc(OC(F)(F)F)cc3)CC2)c1
Show InChI InChI=1S/C25H28F3N3O4/c26-25(27,28)35-21-7-5-19(6-8-21)29-23(34)31-15-12-24(17-31)10-13-30(14-11-24)22(33)9-4-18-2-1-3-20(32)16-18/h1-3,5-8,16,32H,4,9-15,17H2,(H,29,34)
n/an/a 0.400n/an/an/an/an/an/a
Toray Industries Inc.
Curated by ChEMBL
Assay Description
Inhibition of human recombinant sEH using cyano(6-methoxy-naphthalen-2-yl)methyl trans-[(3-phenyloxiran-2-yl)methyl]carbonate after 20 to 45 mins by ...
Bioorg Med Chem Lett 23: 5975-9 (2013)
Article DOI: 10.1016/j.bmcl.2013.08.054
BindingDB Entry DOI: 10.7270/Q2TT4SDR
Soluble epoxide hydrolase (sEH)
(Mus musculus (Mouse))
BDBM50441486
(CHEMBL2436593)
Show SMILES Oc1cccc(CCC(=O)N2CCC3(CCN(C3)C(=O)Nc3ccc(OC(F)(F)F)cc3)CC2)c1
Show InChI InChI=1S/C25H28F3N3O4/c26-25(27,28)35-21-7-5-19(6-8-21)29-23(34)31-15-12-24(17-31)10-13-30(14-11-24)22(33)9-4-18-2-1-3-20(32)16-18/h1-3,5-8,16,32H,4,9-15,17H2,(H,29,34)
n/an/a 22n/an/an/an/an/an/a
Toray Industries Inc.
Curated by ChEMBL
Assay Description
Inhibition of mouse sEH using cyano(6-methoxy-naphthalen-2-yl)methyl trans-[(3-phenyloxiran-2-yl)methyl]carbonate after 20 to 45 mins by fluorescence...
Bioorg Med Chem Lett 23: 5975-9 (2013)
Article DOI: 10.1016/j.bmcl.2013.08.054
BindingDB Entry DOI: 10.7270/Q2TT4SDR