null
SMILES: CCCCOc1c(NCCNc2ccnc3cc(Cl)ccc23)c(=O)c1=O
InChI Key: InChIKey=JNAZPDNJMCNRBI-UHFFFAOYSA-N
Activity Spreadsheet -- Enzyme Inhibition Constant Data from BindingDB
Found 1 hit for monomerid = 50441682
Trg + Lig
Ki
nM
ΔG°
kcal/mole
IC50
nM
Kd
nM
EC50/IC50
nM
koff
s-1
kon
M-1s-1
pHTemp
°C
Papain
(Carica papaya)
BDBM50441682
(CHEMBL2435696)
Show SMILES CCCCOc1c(NCCNc2ccnc3cc(Cl)ccc23)c(=O)c1=O
Show InChI InChI=1S/C19H20ClN3O3/c1-2-3-10-26-19-16(17(24)18(19)25)23-9-8-22-14-6-7-21-15-11-12(20)4-5-13(14)15/h4-7,11,23H,2-3,8-10H2,1H3,(H,21,22)
n/an/a>1.00E+4n/an/an/an/an/an/a
University of Lisbon. Av. Prof. Gama Pinto
Curated by ChEMBL
Assay Description
Inhibition of papaya papain using Z-Leu-Leu-Arg-AMC as substrate after 30 mins by fluorescence microplate reader analysis
Eur J Med Chem 69: 365-72 (2013)
Article DOI: 10.1016/j.ejmech.2013.08.037
BindingDB Entry DOI: 10.7270/Q2CN75BS