BDBM50441691 CHEMBL2435860
SMILES: CC(CCNC(=O)c1c(C)cc(Cl)nc1C)N1CCC(CC1)N1[C@@H](CN(Cc2ccccc2)C1=O)c1ccccc1
InChI Key: InChIKey=QQPGVUMKWQYOEK-PEFOLFAWSA-N
Data: 3 IC50
Activity Spreadsheet -- Enzyme Inhibition Constant Data from BindingDB
Found 3 hits for monomerid = 50441691
Trg + Lig
Ki
nM
ΔG°
kcal/mole
IC50
nM
Kd
nM
EC50/IC50
nM
koff
s-1
kon
M-1s-1
pHTemp
°C
C-C chemokine receptor type 5
(Homo sapiens (Human))
BDBM50441691
(CHEMBL2435860)
Show SMILES CC(CCNC(=O)c1c(C)cc(Cl)nc1C)N1CCC(CC1)N1[C@@H](CN(Cc2ccccc2)C1=O)c1ccccc1 |r|
Show InChI InChI=1S/C33H40ClN5O2/c1-23-20-30(34)36-25(3)31(23)32(40)35-17-14-24(2)37-18-15-28(16-19-37)39-29(27-12-8-5-9-13-27)22-38(33(39)41)21-26-10-6-4-7-11-26/h4-13,20,24,28-29H,14-19,21-22H2,1-3H3,(H,35,40)/t24?,29-/m0/s1
n/an/a 9n/an/an/an/an/an/a
Sanofi
Curated by ChEMBL
Assay Description
Displacement of [125I]-RANTES from CCR5 (unknown origin) expressed in HEK293F cell membranes after 45 mins by microbeta jet liquid scintillation coun...
J Med Chem 56: 8049-65 (2013)
Article DOI: 10.1021/jm401101p
BindingDB Entry DOI: 10.7270/Q2445NX3
C-C chemokine receptor type 5
(Homo sapiens (Human))
BDBM50441691
(CHEMBL2435860)
Show SMILES CC(CCNC(=O)c1c(C)cc(Cl)nc1C)N1CCC(CC1)N1[C@@H](CN(Cc2ccccc2)C1=O)c1ccccc1 |r|
Show InChI InChI=1S/C33H40ClN5O2/c1-23-20-30(34)36-25(3)31(23)32(40)35-17-14-24(2)37-18-15-28(16-19-37)39-29(27-12-8-5-9-13-27)22-38(33(39)41)21-26-10-6-4-7-11-26/h4-13,20,24,28-29H,14-19,21-22H2,1-3H3,(H,35,40)/t24?,29-/m0/s1
n/an/a 1.20n/an/an/an/an/an/a
Sanofi
Curated by ChEMBL
Assay Description
Inhibition of CCR5 (unknown origin) expressed in human HeLa cells assessed as inhibition of interaction of CHO cells expressing HIV-1 JRFLenv and HIV...
J Med Chem 56: 8049-65 (2013)
Article DOI: 10.1021/jm401101p
BindingDB Entry DOI: 10.7270/Q2445NX3
C-C chemokine receptor type 5
(Homo sapiens (Human))
BDBM50441691
(CHEMBL2435860)
Show SMILES CC(CCNC(=O)c1c(C)cc(Cl)nc1C)N1CCC(CC1)N1[C@@H](CN(Cc2ccccc2)C1=O)c1ccccc1 |r|
Show InChI InChI=1S/C33H40ClN5O2/c1-23-20-30(34)36-25(3)31(23)32(40)35-17-14-24(2)37-18-15-28(16-19-37)39-29(27-12-8-5-9-13-27)22-38(33(39)41)21-26-10-6-4-7-11-26/h4-13,20,24,28-29H,14-19,21-22H2,1-3H3,(H,35,40)/t24?,29-/m0/s1
n/an/a 1.30n/an/an/an/an/an/a
Sanofi
Curated by ChEMBL
Assay Description
Antagonist activity at CCR5 (unknown origin) expressed in HEK293F cell membranes assessed as inhibition of RANTES-induced calcium flux preincubated f...
J Med Chem 56: 8049-65 (2013)
Article DOI: 10.1021/jm401101p
BindingDB Entry DOI: 10.7270/Q2445NX3