BDBM50441717 CHEMBL2435852
SMILES: Cc1nc(Oc2ccc(cc2)C(O)=O)ccc1CN1CCC(CC1)N1[C@@H](CN(C2CCOCC2)C1=O)c1ccccc1
InChI Key: InChIKey=NAYZSSQGIKJDGG-PMERELPUSA-N
Data: 8 IC50
Activity Spreadsheet -- Enzyme Inhibition Constant Data from BindingDB
Found 8 hits for monomerid = 50441717
Trg + Lig
Ki
nM
ΔG°
kcal/mole
IC50
nM
Kd
nM
EC50/IC50
nM
koff
s-1
kon
M-1s-1
pHTemp
°C
Cytochrome P450 2D6
(Homo sapiens (Human))
BDBM50441717
(CHEMBL2435852)
Show SMILES Cc1nc(Oc2ccc(cc2)C(O)=O)ccc1CN1CCC(CC1)N1[C@@H](CN(C2CCOCC2)C1=O)c1ccccc1 |r|
Show InChI InChI=1S/C33H38N4O5/c1-23-26(9-12-31(34-23)42-29-10-7-25(8-11-29)32(38)39)21-35-17-13-28(14-18-35)37-30(24-5-3-2-4-6-24)22-36(33(37)40)27-15-19-41-20-16-27/h2-12,27-28,30H,13-22H2,1H3,(H,38,39)/t30-/m0/s1
n/an/a>4.00E+4n/an/an/an/an/an/a
Sanofi
Curated by ChEMBL
Assay Description
Inhibition of CYP2D6 (unknown origin)
J Med Chem 56: 8049-65 (2013)
Article DOI: 10.1021/jm401101p
BindingDB Entry DOI: 10.7270/Q2445NX3
Cytochrome P450 2C19
(Homo sapiens (Human))
BDBM50441717
(CHEMBL2435852)
Show SMILES Cc1nc(Oc2ccc(cc2)C(O)=O)ccc1CN1CCC(CC1)N1[C@@H](CN(C2CCOCC2)C1=O)c1ccccc1 |r|
Show InChI InChI=1S/C33H38N4O5/c1-23-26(9-12-31(34-23)42-29-10-7-25(8-11-29)32(38)39)21-35-17-13-28(14-18-35)37-30(24-5-3-2-4-6-24)22-36(33(37)40)27-15-19-41-20-16-27/h2-12,27-28,30H,13-22H2,1H3,(H,38,39)/t30-/m0/s1
Reactome pathway
n/an/a>4.00E+4n/an/an/an/an/an/a
Sanofi
Curated by ChEMBL
Assay Description
Inhibition of CYP2C19 (unknown origin)
J Med Chem 56: 8049-65 (2013)
Article DOI: 10.1021/jm401101p
BindingDB Entry DOI: 10.7270/Q2445NX3
Cytochrome P450 2C9
(Homo sapiens (Human))
BDBM50441717
(CHEMBL2435852)
Show SMILES Cc1nc(Oc2ccc(cc2)C(O)=O)ccc1CN1CCC(CC1)N1[C@@H](CN(C2CCOCC2)C1=O)c1ccccc1 |r|
Show InChI InChI=1S/C33H38N4O5/c1-23-26(9-12-31(34-23)42-29-10-7-25(8-11-29)32(38)39)21-35-17-13-28(14-18-35)37-30(24-5-3-2-4-6-24)22-36(33(37)40)27-15-19-41-20-16-27/h2-12,27-28,30H,13-22H2,1H3,(H,38,39)/t30-/m0/s1
Reactome pathway
n/an/a>4.00E+4n/an/an/an/an/an/a
Sanofi
Curated by ChEMBL
Assay Description
Inhibition of CYP2C9 (unknown origin)
J Med Chem 56: 8049-65 (2013)
Article DOI: 10.1021/jm401101p
BindingDB Entry DOI: 10.7270/Q2445NX3
C-C chemokine receptor type 4
(Homo sapiens (Human))
BDBM50441717
(CHEMBL2435852)
Show SMILES Cc1nc(Oc2ccc(cc2)C(O)=O)ccc1CN1CCC(CC1)N1[C@@H](CN(C2CCOCC2)C1=O)c1ccccc1 |r|
Show InChI InChI=1S/C33H38N4O5/c1-23-26(9-12-31(34-23)42-29-10-7-25(8-11-29)32(38)39)21-35-17-13-28(14-18-35)37-30(24-5-3-2-4-6-24)22-36(33(37)40)27-15-19-41-20-16-27/h2-12,27-28,30H,13-22H2,1H3,(H,38,39)/t30-/m0/s1
n/an/a 566n/an/an/an/an/an/a
Sanofi
Curated by ChEMBL
Assay Description
Antagonist activity at CCR4 (unknown origin) expressed in HEK293F cell membranes assessed as inhibition of TARC-induced calcium flux preincubated for...
J Med Chem 56: 8049-65 (2013)
Article DOI: 10.1021/jm401101p
BindingDB Entry DOI: 10.7270/Q2445NX3
Cytochrome P450 2B6
(Homo sapiens (Human))
BDBM50441717
(CHEMBL2435852)
Show SMILES Cc1nc(Oc2ccc(cc2)C(O)=O)ccc1CN1CCC(CC1)N1[C@@H](CN(C2CCOCC2)C1=O)c1ccccc1 |r|
Show InChI InChI=1S/C33H38N4O5/c1-23-26(9-12-31(34-23)42-29-10-7-25(8-11-29)32(38)39)21-35-17-13-28(14-18-35)37-30(24-5-3-2-4-6-24)22-36(33(37)40)27-15-19-41-20-16-27/h2-12,27-28,30H,13-22H2,1H3,(H,38,39)/t30-/m0/s1
n/an/a>4.00E+4n/an/an/an/an/an/a
Sanofi
Curated by ChEMBL
Assay Description
Inhibition of CYP2B6 (unknown origin)
J Med Chem 56: 8049-65 (2013)
Article DOI: 10.1021/jm401101p
BindingDB Entry DOI: 10.7270/Q2445NX3
Cytochrome P450 1A2
(Homo sapiens (Human))
BDBM50441717
(CHEMBL2435852)
Show SMILES Cc1nc(Oc2ccc(cc2)C(O)=O)ccc1CN1CCC(CC1)N1[C@@H](CN(C2CCOCC2)C1=O)c1ccccc1 |r|
Show InChI InChI=1S/C33H38N4O5/c1-23-26(9-12-31(34-23)42-29-10-7-25(8-11-29)32(38)39)21-35-17-13-28(14-18-35)37-30(24-5-3-2-4-6-24)22-36(33(37)40)27-15-19-41-20-16-27/h2-12,27-28,30H,13-22H2,1H3,(H,38,39)/t30-/m0/s1
Reactome pathway
n/an/a>4.00E+4n/an/an/an/an/an/a
Sanofi
Curated by ChEMBL
Assay Description
Inhibition of CYP1A2 (unknown origin)
J Med Chem 56: 8049-65 (2013)
Article DOI: 10.1021/jm401101p
BindingDB Entry DOI: 10.7270/Q2445NX3
C-C chemokine receptor type 5
(Homo sapiens (Human))
BDBM50441717
(CHEMBL2435852)
Show SMILES Cc1nc(Oc2ccc(cc2)C(O)=O)ccc1CN1CCC(CC1)N1[C@@H](CN(C2CCOCC2)C1=O)c1ccccc1 |r|
Show InChI InChI=1S/C33H38N4O5/c1-23-26(9-12-31(34-23)42-29-10-7-25(8-11-29)32(38)39)21-35-17-13-28(14-18-35)37-30(24-5-3-2-4-6-24)22-36(33(37)40)27-15-19-41-20-16-27/h2-12,27-28,30H,13-22H2,1H3,(H,38,39)/t30-/m0/s1
n/an/a 1.40n/an/an/an/an/an/a
Sanofi
Curated by ChEMBL
Assay Description
Inhibition of CCR5 (unknown origin) expressed in human HeLa cells assessed as inhibition of interaction of CHO cells expressing HIV-1 JRFLenv and HIV...
J Med Chem 56: 8049-65 (2013)
Article DOI: 10.1021/jm401101p
BindingDB Entry DOI: 10.7270/Q2445NX3
Cytochrome P450 2C8
(Homo sapiens (Human))
BDBM50441717
(CHEMBL2435852)
Show SMILES Cc1nc(Oc2ccc(cc2)C(O)=O)ccc1CN1CCC(CC1)N1[C@@H](CN(C2CCOCC2)C1=O)c1ccccc1 |r|
Show InChI InChI=1S/C33H38N4O5/c1-23-26(9-12-31(34-23)42-29-10-7-25(8-11-29)32(38)39)21-35-17-13-28(14-18-35)37-30(24-5-3-2-4-6-24)22-36(33(37)40)27-15-19-41-20-16-27/h2-12,27-28,30H,13-22H2,1H3,(H,38,39)/t30-/m0/s1
n/an/a>4.00E+4n/an/an/an/an/an/a
Sanofi
Curated by ChEMBL
Assay Description
Inhibition of CYP2C8 (unknown origin)
J Med Chem 56: 8049-65 (2013)
Article DOI: 10.1021/jm401101p
BindingDB Entry DOI: 10.7270/Q2445NX3