BDBM50441821 CHEMBL2436223::US9422331, 27
SMILES: CN[C@@H](C)C(=O)N[C@H]1[C@H](C)N(C(=O)CS(C)(=O)=O)c2cc(ccc2N(Cc2c(OC)ccc3ccccc23)C1=O)C#N
InChI Key: InChIKey=KAOBYIPCGFGNBY-CLWPXKJUSA-N
Data: 4 IC50
Activity Spreadsheet -- Enzyme Inhibition Constant Data from BindingDB
Found 4 hits for monomerid = 50441821
Trg + Lig
Ki
nM
ΔG°
kcal/mole
IC50
nM
Kd
nM
EC50/IC50
nM
koff
s-1
kon
M-1s-1
pHTemp
°C
E3 ubiquitin-protein ligase XIAP [124-214,C202A,C213G]
(Artificial Organism)
BDBM50441821
(CHEMBL2436223 | US9422331, 27)
Show SMILES CN[C@@H](C)C(=O)N[C@H]1[C@H](C)N(C(=O)CS(C)(=O)=O)c2cc(ccc2N(Cc2c(OC)ccc3ccccc23)C1=O)C#N |r|
Show InChI InChI=1S/C30H33N5O6S/c1-18(32-3)29(37)33-28-19(2)35(27(36)17-42(5,39)40)25-14-20(15-31)10-12-24(25)34(30(28)38)16-23-22-9-7-6-8-21(22)11-13-26(23)41-4/h6-14,18-19,28,32H,16-17H2,1-5H3,(H,33,37)/t18-,19-,28-/m0/s1
US Patent
n/an/a 10n/an/an/an/a7.537
HOFFMANN-LA ROCHE INC.
US Patent
Assay Description
The peptide AVPIAQKSEK-(ε-biotin)-OH 1:2 TFA ("Peptide A") was identified as a substrate for the TR-FRET assay by screening the 6× Hist...
US Patent US9422331 (2016)
BindingDB Entry DOI: 10.7270/Q2736PT4
E3 ubiquitin-protein ligase XIAP
(Homo sapiens (Human))
BDBM50441821
(CHEMBL2436223 | US9422331, 27)
Show SMILES CN[C@@H](C)C(=O)N[C@H]1[C@H](C)N(C(=O)CS(C)(=O)=O)c2cc(ccc2N(Cc2c(OC)ccc3ccccc23)C1=O)C#N |r|
Show InChI InChI=1S/C30H33N5O6S/c1-18(32-3)29(37)33-28-19(2)35(27(36)17-42(5,39)40)25-14-20(15-31)10-12-24(25)34(30(28)38)16-23-22-9-7-6-8-21(22)11-13-26(23)41-4/h6-14,18-19,28,32H,16-17H2,1-5H3,(H,33,37)/t18-,19-,28-/m0/s1
n/an/a 10n/an/an/an/an/an/a
Hoffmann-La Roche Inc.
Curated by ChEMBL
Assay Description
Displacement of AVPIAQKSEK (epsilon-biotin)-OH from 6xhistidine-thrombin-TEV-tagged XIAP BIR2 domain (124 to 240) (unknown origin) after 45 mins by T...
J Med Chem 56: 7788-803 (2013)
Article DOI: 10.1021/jm400732v
BindingDB Entry DOI: 10.7270/Q2M32X6V
E3 ubiquitin-protein ligase XIAP
(Homo sapiens (Human))
BDBM50441821
(CHEMBL2436223 | US9422331, 27)
Show SMILES CN[C@@H](C)C(=O)N[C@H]1[C@H](C)N(C(=O)CS(C)(=O)=O)c2cc(ccc2N(Cc2c(OC)ccc3ccccc23)C1=O)C#N |r|
Show InChI InChI=1S/C30H33N5O6S/c1-18(32-3)29(37)33-28-19(2)35(27(36)17-42(5,39)40)25-14-20(15-31)10-12-24(25)34(30(28)38)16-23-22-9-7-6-8-21(22)11-13-26(23)41-4/h6-14,18-19,28,32H,16-17H2,1-5H3,(H,33,37)/t18-,19-,28-/m0/s1
n/an/a 1.29E+4n/an/an/an/an/an/a
Hoffmann-La Roche Inc.
Curated by ChEMBL
Assay Description
Displacement of AVPIAQKSEK (epsilon-biotin)-OH from 6xhistidine-thrombin-TEV-tagged XIAP BIR3 domain (241 to 356) (unknown origin) after 45 mins by T...
J Med Chem 56: 7788-803 (2013)
Article DOI: 10.1021/jm400732v
BindingDB Entry DOI: 10.7270/Q2M32X6V
E3 ubiquitin-protein ligase XIAP [241-356]
(Homo sapiens (Human))
BDBM50441821
(CHEMBL2436223 | US9422331, 27)
Show SMILES CN[C@@H](C)C(=O)N[C@H]1[C@H](C)N(C(=O)CS(C)(=O)=O)c2cc(ccc2N(Cc2c(OC)ccc3ccccc23)C1=O)C#N |r|
Show InChI InChI=1S/C30H33N5O6S/c1-18(32-3)29(37)33-28-19(2)35(27(36)17-42(5,39)40)25-14-20(15-31)10-12-24(25)34(30(28)38)16-23-22-9-7-6-8-21(22)11-13-26(23)41-4/h6-14,18-19,28,32H,16-17H2,1-5H3,(H,33,37)/t18-,19-,28-/m0/s1
Reactome pathway
US Patent
n/an/a 1.29E+4n/an/an/an/a7.537
HOFFMANN-LA ROCHE INC.
US Patent
Assay Description
The peptide AVPIAQKSEK-(ε-biotin)-OH 1:2 TFA ("Peptide A") was identified as a substrate for the TR-FRET assay by screening the 6× Hist...
US Patent US9422331 (2016)
BindingDB Entry DOI: 10.7270/Q2736PT4