BDBM50442109 CHEMBL2441075
SMILES: COc1cc2c(NC3CCN(CC3)C(C)C)nc(nc2cc1OCCCN1CCC(F)(F)CC1)C1CCCCC1
InChI Key: InChIKey=RBIVSCSLAAWBKB-UHFFFAOYSA-N
Data: 1 IC50
Activity Spreadsheet -- Enzyme Inhibition Constant Data from BindingDB
Found 1 hit for monomerid = 50442109
Trg + Lig
Ki
nM
ΔG°
kcal/mole
IC50
nM
Kd
nM
EC50/IC50
nM
koff
s-1
kon
M-1s-1
pHTemp
°C
Protein G9a (G9a)
(Homo sapiens (Human))
BDBM50442109
(CHEMBL2441075)
Show SMILES COc1cc2c(NC3CCN(CC3)C(C)C)nc(nc2cc1OCCCN1CCC(F)(F)CC1)C1CCCCC1
Show InChI InChI=1S/C31H47F2N5O2/c1-22(2)38-15-10-24(11-16-38)34-30-25-20-27(39-3)28(40-19-7-14-37-17-12-31(32,33)13-18-37)21-26(25)35-29(36-30)23-8-5-4-6-9-23/h20-24H,4-19H2,1-3H3,(H,34,35,36)
n/an/a>2.60E+4n/an/an/an/an/an/a
University of North Carolina at Chapel Hill
Curated by ChEMBL
Assay Description
Inhibition of lysine methyltransferase G9a (unknown origin) using [3H]-SAM as substrate after 0.25 hrs by scintillation proximity assay
J Med Chem 56: 8931-42 (2013)
Article DOI: 10.1021/jm401480r
BindingDB Entry DOI: 10.7270/Q2NZ892T