BDBM50442299 CHEMBL2442750
SMILES: Cc1c(CC(O)=O)c2cccnc2n1Cc1ccc(cc1)S(C)(=O)=O
InChI Key: InChIKey=YOPFAMROKXHVCQ-UHFFFAOYSA-N
Data: 3 KI  24 IC50  1 Kd
Activity Spreadsheet -- Enzyme Inhibition Constant Data from BindingDB
Found 28 hits for monomerid = 50442299
Trg + Lig
Ki
nM
ΔG°
kcal/mole
IC50
nM
Kd
nM
EC50/IC50
nM
koff
s-1
kon
M-1s-1
pHTemp
°C
G protein-coupled receptor 44
(Mus musculus (mouse))
BDBM50442299
(CHEMBL2442750)
Show SMILES Cc1c(CC(O)=O)c2cccnc2n1Cc1ccc(cc1)S(C)(=O)=O
Show InChI InChI=1S/C18H18N2O4S/c1-12-16(10-17(21)22)15-4-3-9-19-18(15)20(12)11-13-5-7-14(8-6-13)25(2,23)24/h3-9H,10-11H2,1-2H3,(H,21,22)
Reactome pathway
10n/an/an/an/an/an/an/an/a
Novartis Institutes for Biomedical Research
Curated by ChEMBL
Assay Description
Displacement of [3H]-prostaglandin D2 from mouse CRTh2 receptor expressed in CHO cells after 2 hrs
Bioorg Med Chem 21: 6582-91 (2013)
Article DOI: 10.1016/j.bmc.2013.08.025
BindingDB Entry DOI: 10.7270/Q2QR4ZKF
G protein-coupled receptor 44
(Homo sapiens (Human))
BDBM50442299
(CHEMBL2442750)
Show SMILES Cc1c(CC(O)=O)c2cccnc2n1Cc1ccc(cc1)S(C)(=O)=O
Show InChI InChI=1S/C18H18N2O4S/c1-12-16(10-17(21)22)15-4-3-9-19-18(15)20(12)11-13-5-7-14(8-6-13)25(2,23)24/h3-9H,10-11H2,1-2H3,(H,21,22)
Reactome pathway
36n/an/an/an/an/an/an/an/a
Novartis Institutes for Biomedical Research
Curated by ChEMBL
Assay Description
Displacement of [3H]PGD2 from human DP2 receptor expressed in CHO cell membranes after 60 mins by scintillation proximity assay
ACS Med Chem Lett 8: 582-586 (2017)
BindingDB Entry DOI: 10.7270/Q2TH8PXN
G protein-coupled receptor 44
(Homo sapiens (Human))
BDBM50442299
(CHEMBL2442750)
Show SMILES Cc1c(CC(O)=O)c2cccnc2n1Cc1ccc(cc1)S(C)(=O)=O
Show InChI InChI=1S/C18H18N2O4S/c1-12-16(10-17(21)22)15-4-3-9-19-18(15)20(12)11-13-5-7-14(8-6-13)25(2,23)24/h3-9H,10-11H2,1-2H3,(H,21,22)
Reactome pathway
36n/an/an/an/an/an/an/an/a
Novartis Institutes for Biomedical Research
Curated by ChEMBL
Assay Description
Displacement of [3H]-prostaglandin D2 from human CRTh2 receptor expressed in CHO cells after 2 hrs
Bioorg Med Chem 21: 6582-91 (2013)
Article DOI: 10.1016/j.bmc.2013.08.025
BindingDB Entry DOI: 10.7270/Q2QR4ZKF
Prostaglandin E2 receptor EP4 subtype
(Homo sapiens (Human))
BDBM50442299
(CHEMBL2442750)
Show SMILES Cc1c(CC(O)=O)c2cccnc2n1Cc1ccc(cc1)S(C)(=O)=O
Show InChI InChI=1S/C18H18N2O4S/c1-12-16(10-17(21)22)15-4-3-9-19-18(15)20(12)11-13-5-7-14(8-6-13)25(2,23)24/h3-9H,10-11H2,1-2H3,(H,21,22)
Reactome pathway
n/an/a>1.00E+4n/an/an/an/an/an/a
Novartis Institutes for Biomedical Research
Curated by ChEMBL
Assay Description
Inhibition of prostanoid EP4 receptor (unknown origin)
Bioorg Med Chem 21: 6582-91 (2013)
Article DOI: 10.1016/j.bmc.2013.08.025
BindingDB Entry DOI: 10.7270/Q2QR4ZKF
G protein-coupled receptor 44
(Homo sapiens (Human))
BDBM50442299
(CHEMBL2442750)
Show SMILES Cc1c(CC(O)=O)c2cccnc2n1Cc1ccc(cc1)S(C)(=O)=O
Show InChI InChI=1S/C18H18N2O4S/c1-12-16(10-17(21)22)15-4-3-9-19-18(15)20(12)11-13-5-7-14(8-6-13)25(2,23)24/h3-9H,10-11H2,1-2H3,(H,21,22)
Reactome pathway
n/an/a>1.00E+4n/an/an/an/an/an/a
Novartis Institutes for Biomedical Research
Curated by ChEMBL
Assay Description
Antagonist activity at CRTh2 receptor in human isolated eosinophil assessed as inhibition of eotaxin-induced shape change after 5 mins by flow cytome...
Bioorg Med Chem 21: 6582-91 (2013)
Article DOI: 10.1016/j.bmc.2013.08.025
BindingDB Entry DOI: 10.7270/Q2QR4ZKF
G protein-coupled receptor 44
(Homo sapiens (Human))
BDBM50442299
(CHEMBL2442750)
Show SMILES Cc1c(CC(O)=O)c2cccnc2n1Cc1ccc(cc1)S(C)(=O)=O
Show InChI InChI=1S/C18H18N2O4S/c1-12-16(10-17(21)22)15-4-3-9-19-18(15)20(12)11-13-5-7-14(8-6-13)25(2,23)24/h3-9H,10-11H2,1-2H3,(H,21,22)
Reactome pathway
n/an/a 31n/an/an/an/an/an/a
Novartis Institutes for Biomedical Research
Curated by ChEMBL
Assay Description
Antagonist activity at CRTh2 receptor in human whole blood assessed as inhibition of DK-PGD2-induced eosinophil shape change after 5 mins by flow cyt...
Bioorg Med Chem 21: 6582-91 (2013)
Article DOI: 10.1016/j.bmc.2013.08.025
BindingDB Entry DOI: 10.7270/Q2QR4ZKF
Prostaglandin E2 receptor
(Homo sapiens (Human))
BDBM50442299
(CHEMBL2442750)
Show SMILES Cc1c(CC(O)=O)c2cccnc2n1Cc1ccc(cc1)S(C)(=O)=O
Show InChI InChI=1S/C18H18N2O4S/c1-12-16(10-17(21)22)15-4-3-9-19-18(15)20(12)11-13-5-7-14(8-6-13)25(2,23)24/h3-9H,10-11H2,1-2H3,(H,21,22)
n/an/a>1.00E+4n/an/an/an/an/an/a
Novartis Institutes for Biomedical Research
Curated by ChEMBL
Assay Description
Inhibition of prostanoid EP3 receptor (unknown origin)
Bioorg Med Chem 21: 6582-91 (2013)
Article DOI: 10.1016/j.bmc.2013.08.025
BindingDB Entry DOI: 10.7270/Q2QR4ZKF
G protein-coupled receptor 44
(Homo sapiens (Human))
BDBM50442299
(CHEMBL2442750)
Show SMILES Cc1c(CC(O)=O)c2cccnc2n1Cc1ccc(cc1)S(C)(=O)=O
Show InChI InChI=1S/C18H18N2O4S/c1-12-16(10-17(21)22)15-4-3-9-19-18(15)20(12)11-13-5-7-14(8-6-13)25(2,23)24/h3-9H,10-11H2,1-2H3,(H,21,22)
Reactome pathway
n/an/a 102n/an/an/an/an/an/a
Novartis Institutes for Biomedical Research
Curated by ChEMBL
Assay Description
Antagonist activity at CRTh2 receptor in human whole blood assessed as inhibition of PGD2-induced eosinophil shape change after 5 mins by flow cytome...
Bioorg Med Chem 21: 6582-91 (2013)
Article DOI: 10.1016/j.bmc.2013.08.025
BindingDB Entry DOI: 10.7270/Q2QR4ZKF
G protein-coupled receptor 44
(Homo sapiens (Human))
BDBM50442299
(CHEMBL2442750)
Show SMILES Cc1c(CC(O)=O)c2cccnc2n1Cc1ccc(cc1)S(C)(=O)=O
Show InChI InChI=1S/C18H18N2O4S/c1-12-16(10-17(21)22)15-4-3-9-19-18(15)20(12)11-13-5-7-14(8-6-13)25(2,23)24/h3-9H,10-11H2,1-2H3,(H,21,22)
Reactome pathway
n/an/a 4n/an/an/an/an/an/a
Novartis Institutes for Biomedical Research
Curated by ChEMBL
Assay Description
Antagonist activity at CRTh2 receptor in human isolated eosinophil assessed as inhibition of 11-Dehydro-TXB2-induced shape change after 5 mins by flo...
Bioorg Med Chem 21: 6582-91 (2013)
Article DOI: 10.1016/j.bmc.2013.08.025
BindingDB Entry DOI: 10.7270/Q2QR4ZKF
G protein-coupled receptor 44
(Homo sapiens (Human))
BDBM50442299
(CHEMBL2442750)
Show SMILES Cc1c(CC(O)=O)c2cccnc2n1Cc1ccc(cc1)S(C)(=O)=O
Show InChI InChI=1S/C18H18N2O4S/c1-12-16(10-17(21)22)15-4-3-9-19-18(15)20(12)11-13-5-7-14(8-6-13)25(2,23)24/h3-9H,10-11H2,1-2H3,(H,21,22)
Reactome pathway
n/an/a 4n/an/an/an/an/an/a
Novartis Institutes for Biomedical Research
Curated by ChEMBL
Assay Description
Antagonist activity at CRTh2 receptor in human isolated eosinophil assessed as inhibition of delta12-PGD2-induced shape change after 5 mins by flow c...
Bioorg Med Chem 21: 6582-91 (2013)
Article DOI: 10.1016/j.bmc.2013.08.025
BindingDB Entry DOI: 10.7270/Q2QR4ZKF
Prostaglandin E2 receptor EP2 subtype
(Homo sapiens (Human))
BDBM50442299
(CHEMBL2442750)
Show SMILES Cc1c(CC(O)=O)c2cccnc2n1Cc1ccc(cc1)S(C)(=O)=O
Show InChI InChI=1S/C18H18N2O4S/c1-12-16(10-17(21)22)15-4-3-9-19-18(15)20(12)11-13-5-7-14(8-6-13)25(2,23)24/h3-9H,10-11H2,1-2H3,(H,21,22)
Reactome pathway
n/an/a>1.00E+4n/an/an/an/an/an/a
Novartis Institutes for Biomedical Research
Curated by ChEMBL
Assay Description
Inhibition of prostanoid EP2 receptor (unknown origin)
Bioorg Med Chem 21: 6582-91 (2013)
Article DOI: 10.1016/j.bmc.2013.08.025
BindingDB Entry DOI: 10.7270/Q2QR4ZKF
Prostanoid TP receptor
(Homo sapiens (Human))
BDBM50442299
(CHEMBL2442750)
Show SMILES Cc1c(CC(O)=O)c2cccnc2n1Cc1ccc(cc1)S(C)(=O)=O
Show InChI InChI=1S/C18H18N2O4S/c1-12-16(10-17(21)22)15-4-3-9-19-18(15)20(12)11-13-5-7-14(8-6-13)25(2,23)24/h3-9H,10-11H2,1-2H3,(H,21,22)
n/an/a>1.00E+4n/an/an/an/an/an/a
Novartis Institutes for Biomedical Research
Curated by ChEMBL
Assay Description
Inhibition of prostanoid TP receptor (unknown origin)
Bioorg Med Chem 21: 6582-91 (2013)
Article DOI: 10.1016/j.bmc.2013.08.025
BindingDB Entry DOI: 10.7270/Q2QR4ZKF
Prostanoid IP receptor
(Homo sapiens (Human))
BDBM50442299
(CHEMBL2442750)
Show SMILES Cc1c(CC(O)=O)c2cccnc2n1Cc1ccc(cc1)S(C)(=O)=O
Show InChI InChI=1S/C18H18N2O4S/c1-12-16(10-17(21)22)15-4-3-9-19-18(15)20(12)11-13-5-7-14(8-6-13)25(2,23)24/h3-9H,10-11H2,1-2H3,(H,21,22)
NCI pathway
Reactome pathway
n/an/a>1.00E+4n/an/an/an/an/an/a
Novartis Institutes for Biomedical Research
Curated by ChEMBL
Assay Description
Inhibition of prostanoid IP receptor (unknown origin)
Bioorg Med Chem 21: 6582-91 (2013)
Article DOI: 10.1016/j.bmc.2013.08.025
BindingDB Entry DOI: 10.7270/Q2QR4ZKF
Prostaglandin F2-alpha receptor
(Homo sapiens (Human))
BDBM50442299
(CHEMBL2442750)
Show SMILES Cc1c(CC(O)=O)c2cccnc2n1Cc1ccc(cc1)S(C)(=O)=O
Show InChI InChI=1S/C18H18N2O4S/c1-12-16(10-17(21)22)15-4-3-9-19-18(15)20(12)11-13-5-7-14(8-6-13)25(2,23)24/h3-9H,10-11H2,1-2H3,(H,21,22)
n/an/a>1.00E+4n/an/an/an/an/an/a
Novartis Institutes for Biomedical Research
Curated by ChEMBL
Assay Description
Inhibition of prostanoid FP receptor (unknown origin)
Bioorg Med Chem 21: 6582-91 (2013)
Article DOI: 10.1016/j.bmc.2013.08.025
BindingDB Entry DOI: 10.7270/Q2QR4ZKF
Prostanoid DP receptor
(Homo sapiens (Human))
BDBM50442299
(CHEMBL2442750)
Show SMILES Cc1c(CC(O)=O)c2cccnc2n1Cc1ccc(cc1)S(C)(=O)=O
Show InChI InChI=1S/C18H18N2O4S/c1-12-16(10-17(21)22)15-4-3-9-19-18(15)20(12)11-13-5-7-14(8-6-13)25(2,23)24/h3-9H,10-11H2,1-2H3,(H,21,22)
n/an/a>1.00E+4n/an/an/an/an/an/a
Novartis Institutes for Biomedical Research
Curated by ChEMBL
Assay Description
Inhibition of prostanoid DP1 receptor (unknown origin)
Bioorg Med Chem 21: 6582-91 (2013)
Article DOI: 10.1016/j.bmc.2013.08.025
BindingDB Entry DOI: 10.7270/Q2QR4ZKF
Cytochrome P450 2D6
(Homo sapiens (Human))
BDBM50442299
(CHEMBL2442750)
Show SMILES Cc1c(CC(O)=O)c2cccnc2n1Cc1ccc(cc1)S(C)(=O)=O
Show InChI InChI=1S/C18H18N2O4S/c1-12-16(10-17(21)22)15-4-3-9-19-18(15)20(12)11-13-5-7-14(8-6-13)25(2,23)24/h3-9H,10-11H2,1-2H3,(H,21,22)
n/an/a>1.00E+5n/an/an/an/an/an/a
Novartis Institutes for Biomedical Research
Curated by ChEMBL
Assay Description
Inhibition of human CYP2D6
Bioorg Med Chem 21: 6582-91 (2013)
Article DOI: 10.1016/j.bmc.2013.08.025
BindingDB Entry DOI: 10.7270/Q2QR4ZKF
Cytochrome P450 2C9
(Homo sapiens (Human))
BDBM50442299
(CHEMBL2442750)
Show SMILES Cc1c(CC(O)=O)c2cccnc2n1Cc1ccc(cc1)S(C)(=O)=O
Show InChI InChI=1S/C18H18N2O4S/c1-12-16(10-17(21)22)15-4-3-9-19-18(15)20(12)11-13-5-7-14(8-6-13)25(2,23)24/h3-9H,10-11H2,1-2H3,(H,21,22)
Reactome pathway
n/an/a>1.00E+5n/an/an/an/an/an/a
Novartis Institutes for Biomedical Research
Curated by ChEMBL
Assay Description
Inhibition of human CYP2C9
Bioorg Med Chem 21: 6582-91 (2013)
Article DOI: 10.1016/j.bmc.2013.08.025
BindingDB Entry DOI: 10.7270/Q2QR4ZKF
Cytochrome P450 1A
(Homo sapiens (Human))
BDBM50442299
(CHEMBL2442750)
Show SMILES Cc1c(CC(O)=O)c2cccnc2n1Cc1ccc(cc1)S(C)(=O)=O
Show InChI InChI=1S/C18H18N2O4S/c1-12-16(10-17(21)22)15-4-3-9-19-18(15)20(12)11-13-5-7-14(8-6-13)25(2,23)24/h3-9H,10-11H2,1-2H3,(H,21,22)
Reactome pathway
n/an/a>1.00E+5n/an/an/an/an/an/a
Novartis Institutes for Biomedical Research
Curated by ChEMBL
Assay Description
Inhibition of human CYP1A2
Bioorg Med Chem 21: 6582-91 (2013)
Article DOI: 10.1016/j.bmc.2013.08.025
BindingDB Entry DOI: 10.7270/Q2QR4ZKF
G protein-coupled receptor 44
(Mus musculus (mouse))
BDBM50442299
(CHEMBL2442750)
Show SMILES Cc1c(CC(O)=O)c2cccnc2n1Cc1ccc(cc1)S(C)(=O)=O
Show InChI InChI=1S/C18H18N2O4S/c1-12-16(10-17(21)22)15-4-3-9-19-18(15)20(12)11-13-5-7-14(8-6-13)25(2,23)24/h3-9H,10-11H2,1-2H3,(H,21,22)
Reactome pathway
n/an/a 94n/an/an/an/an/an/a
Novartis Institutes for Biomedical Research
Curated by ChEMBL
Assay Description
Antagonist activity at mouse CRTh2 receptor expressed in CHO-K1 cells assessed as inhibition of [125S]-GTP-gamma-S binding after 50 mins by liquid sc...
Bioorg Med Chem 21: 6582-91 (2013)
Article DOI: 10.1016/j.bmc.2013.08.025
BindingDB Entry DOI: 10.7270/Q2QR4ZKF
G protein-coupled receptor 44
(Homo sapiens (Human))
BDBM50442299
(CHEMBL2442750)
Show SMILES Cc1c(CC(O)=O)c2cccnc2n1Cc1ccc(cc1)S(C)(=O)=O
Show InChI InChI=1S/C18H18N2O4S/c1-12-16(10-17(21)22)15-4-3-9-19-18(15)20(12)11-13-5-7-14(8-6-13)25(2,23)24/h3-9H,10-11H2,1-2H3,(H,21,22)
Reactome pathway
n/an/a 3n/an/an/an/an/an/a
Novartis Institutes for Biomedical Research
Curated by ChEMBL
Assay Description
Antagonist activity at CRTh2 receptor in human isolated eosinophil assessed as inhibition of DK-PGD2-induced shape change after 5 mins by flow cytome...
Bioorg Med Chem 21: 6582-91 (2013)
Article DOI: 10.1016/j.bmc.2013.08.025
BindingDB Entry DOI: 10.7270/Q2QR4ZKF
G protein-coupled receptor 44
(Homo sapiens (Human))
BDBM50442299
(CHEMBL2442750)
Show SMILES Cc1c(CC(O)=O)c2cccnc2n1Cc1ccc(cc1)S(C)(=O)=O
Show InChI InChI=1S/C18H18N2O4S/c1-12-16(10-17(21)22)15-4-3-9-19-18(15)20(12)11-13-5-7-14(8-6-13)25(2,23)24/h3-9H,10-11H2,1-2H3,(H,21,22)
Reactome pathway
n/an/a 5n/an/an/an/an/an/a
Novartis Institutes for Biomedical Research
Curated by ChEMBL
Assay Description
Antagonist activity at DP2 receptor in human whole assessed as inhibition of DK-PGD2-induced eosinophils shape change preincubated for 5 mins followe...
ACS Med Chem Lett 8: 582-586 (2017)
BindingDB Entry DOI: 10.7270/Q2TH8PXN
G protein-coupled receptor 44
(Homo sapiens (Human))
BDBM50442299
(CHEMBL2442750)
Show SMILES Cc1c(CC(O)=O)c2cccnc2n1Cc1ccc(cc1)S(C)(=O)=O
Show InChI InChI=1S/C18H18N2O4S/c1-12-16(10-17(21)22)15-4-3-9-19-18(15)20(12)11-13-5-7-14(8-6-13)25(2,23)24/h3-9H,10-11H2,1-2H3,(H,21,22)
Reactome pathway
n/an/a 25n/an/an/an/an/an/a
Novartis Institutes for Biomedical Research
Curated by ChEMBL
Assay Description
Antagonist activity at DP2 receptor in CD4-positive human TH2 cells assessed as inhibition of DK-PGD2-induced IL-13 production after 6 to 8 hrs
ACS Med Chem Lett 8: 582-586 (2017)
BindingDB Entry DOI: 10.7270/Q2TH8PXN
G protein-coupled receptor 44
(Homo sapiens (Human))
BDBM50442299
(CHEMBL2442750)
Show SMILES Cc1c(CC(O)=O)c2cccnc2n1Cc1ccc(cc1)S(C)(=O)=O
Show InChI InChI=1S/C18H18N2O4S/c1-12-16(10-17(21)22)15-4-3-9-19-18(15)20(12)11-13-5-7-14(8-6-13)25(2,23)24/h3-9H,10-11H2,1-2H3,(H,21,22)
Reactome pathway
n/an/an/a 15n/an/an/an/an/a
Novartis Institutes for Biomedical Research
Curated by ChEMBL
Assay Description
Displacement of [3H]NVP-QAW039 from human DP2 receptor expressed in CHO cell membranes by TopCount scintillation assay
ACS Med Chem Lett 8: 582-586 (2017)
BindingDB Entry DOI: 10.7270/Q2TH8PXN
G protein-coupled receptor 44
(Homo sapiens (Human))
BDBM50442299
(CHEMBL2442750)
Show SMILES Cc1c(CC(O)=O)c2cccnc2n1Cc1ccc(cc1)S(C)(=O)=O
Show InChI InChI=1S/C18H18N2O4S/c1-12-16(10-17(21)22)15-4-3-9-19-18(15)20(12)11-13-5-7-14(8-6-13)25(2,23)24/h3-9H,10-11H2,1-2H3,(H,21,22)
Reactome pathway
n/an/a 31n/an/an/an/an/an/a
Novartis Institutes for Biomedical Research
Curated by ChEMBL
Assay Description
Antagonist activity at DP2 receptor in human whole assessed as inhibition of DK-PGD2-induced eosinophils shape change preincubated for 5 mins followe...
ACS Med Chem Lett 8: 582-586 (2017)
BindingDB Entry DOI: 10.7270/Q2TH8PXN
Cytochrome P450 3A4
(Homo sapiens (Human))
BDBM50442299
(CHEMBL2442750)
Show SMILES Cc1c(CC(O)=O)c2cccnc2n1Cc1ccc(cc1)S(C)(=O)=O
Show InChI InChI=1S/C18H18N2O4S/c1-12-16(10-17(21)22)15-4-3-9-19-18(15)20(12)11-13-5-7-14(8-6-13)25(2,23)24/h3-9H,10-11H2,1-2H3,(H,21,22)
Reactome pathway
n/an/a>1.00E+5n/an/an/an/an/an/a
Novartis Institutes for Biomedical Research
Curated by ChEMBL
Assay Description
Inhibition of human CYP3A4
Bioorg Med Chem 21: 6582-91 (2013)
Article DOI: 10.1016/j.bmc.2013.08.025
BindingDB Entry DOI: 10.7270/Q2QR4ZKF
G protein-coupled receptor 44
(Homo sapiens (Human))
BDBM50442299
(CHEMBL2442750)
Show SMILES Cc1c(CC(O)=O)c2cccnc2n1Cc1ccc(cc1)S(C)(=O)=O
Show InChI InChI=1S/C18H18N2O4S/c1-12-16(10-17(21)22)15-4-3-9-19-18(15)20(12)11-13-5-7-14(8-6-13)25(2,23)24/h3-9H,10-11H2,1-2H3,(H,21,22)
Reactome pathway
n/an/a 59n/an/an/an/an/an/a
Novartis Institutes for Biomedical Research
Curated by ChEMBL
Assay Description
Antagonist activity at DP2 receptor in CD4-positive human TH2 cells assessed as inhibition of DK-PGD2-induced IL-5 production after 6 to 8 hrs
ACS Med Chem Lett 8: 582-586 (2017)
BindingDB Entry DOI: 10.7270/Q2TH8PXN
G protein-coupled receptor 44
(Homo sapiens (Human))
BDBM50442299
(CHEMBL2442750)
Show SMILES Cc1c(CC(O)=O)c2cccnc2n1Cc1ccc(cc1)S(C)(=O)=O
Show InChI InChI=1S/C18H18N2O4S/c1-12-16(10-17(21)22)15-4-3-9-19-18(15)20(12)11-13-5-7-14(8-6-13)25(2,23)24/h3-9H,10-11H2,1-2H3,(H,21,22)
Reactome pathway
n/an/a 37n/an/an/an/an/an/a
Novartis Institutes for Biomedical Research
Curated by ChEMBL
Assay Description
Antagonist activity at human CRTh2 receptor expressed in CHO cells assessed as inhibition of prostaglandin D2 and forskolin-induced cAMP accumulation...
Bioorg Med Chem 21: 6582-91 (2013)
Article DOI: 10.1016/j.bmc.2013.08.025
BindingDB Entry DOI: 10.7270/Q2QR4ZKF
G protein-coupled receptor 44
(Homo sapiens (Human))
BDBM50442299
(CHEMBL2442750)
Show SMILES Cc1c(CC(O)=O)c2cccnc2n1Cc1ccc(cc1)S(C)(=O)=O
Show InChI InChI=1S/C18H18N2O4S/c1-12-16(10-17(21)22)15-4-3-9-19-18(15)20(12)11-13-5-7-14(8-6-13)25(2,23)24/h3-9H,10-11H2,1-2H3,(H,21,22)
Reactome pathway
n/an/a 5n/an/an/an/an/an/a
Novartis Institutes for Biomedical Research
Curated by ChEMBL
Assay Description
Antagonist activity at CRTh2 receptor in human isolated eosinophil assessed as inhibition of DK-PGD2-induced shape change after 5 mins by flow cytome...
Bioorg Med Chem 21: 6582-91 (2013)
Article DOI: 10.1016/j.bmc.2013.08.025
BindingDB Entry DOI: 10.7270/Q2QR4ZKF