BDBM50442392 CHEMBL2442895
SMILES: CCCCCSc1nc(ccc1CNC(=O)C(C)c1ccc(NS(C)(=O)=O)c(F)c1)C(F)(F)F
InChI Key: InChIKey=WANPEYKEPQFXDL-UHFFFAOYSA-N
Data: 1 KI  1 IC50
Activity Spreadsheet -- Enzyme Inhibition Constant Data from BindingDB
Found 2 hits for monomerid = 50442392
Trg + Lig
Ki
nM
ΔG°
kcal/mole
IC50
nM
Kd
nM
EC50/IC50
nM
koff
s-1
kon
M-1s-1
pHTemp
°C
Transient receptor potential cation channel subfamily V member 1
(Homo sapiens (Human))
BDBM50442392
(CHEMBL2442895)
Show SMILES CCCCCSc1nc(ccc1CNC(=O)C(C)c1ccc(NS(C)(=O)=O)c(F)c1)C(F)(F)F
Show InChI InChI=1S/C22H27F4N3O3S2/c1-4-5-6-11-33-21-16(8-10-19(28-21)22(24,25)26)13-27-20(30)14(2)15-7-9-18(17(23)12-15)29-34(3,31)32/h7-10,12,14,29H,4-6,11,13H2,1-3H3,(H,27,30)
Reactome pathway
2.5n/an/an/an/an/an/an/an/a
Seoul National University
Curated by ChEMBL
Assay Description
Antagonist activity at human TRPV1 expressed in CHOK1 cells assessed as inhibition of capsaicin-induced activity by FLIPR assay
Bioorg Med Chem 21: 6657-64 (2013)
Article DOI: 10.1016/j.bmc.2013.08.015
BindingDB Entry DOI: 10.7270/Q26Q1ZPN
Transient receptor potential cation channel subfamily V member 1
(Homo sapiens (Human))
BDBM50442392
(CHEMBL2442895)
Show SMILES CCCCCSc1nc(ccc1CNC(=O)C(C)c1ccc(NS(C)(=O)=O)c(F)c1)C(F)(F)F
Show InChI InChI=1S/C22H27F4N3O3S2/c1-4-5-6-11-33-21-16(8-10-19(28-21)22(24,25)26)13-27-20(30)14(2)15-7-9-18(17(23)12-15)29-34(3,31)32/h7-10,12,14,29H,4-6,11,13H2,1-3H3,(H,27,30)
Reactome pathway
n/an/a 96n/an/an/an/an/an/a
Seoul National University
Curated by ChEMBL
Assay Description
Antagonist activity at human TRPV1 expressed in CHOK1 cells assessed as inhibition of pH-induced activity by FLIPR assay
Bioorg Med Chem 21: 6657-64 (2013)
Article DOI: 10.1016/j.bmc.2013.08.015
BindingDB Entry DOI: 10.7270/Q26Q1ZPN