BDBM50442398 CHEMBL2442949
SMILES: [#6]\[#6](-[#6])=[#6]\[#6]-c1c2-[#8]C([#6])([#6])[#6](=[#6]-c2c(-[#8])c2c1occ(-c1ccc(-[#8])cc1)c2=O)C([#6])([#6])[#6]=[#6]
InChI Key: InChIKey=RREXXCHIBJFPKH-UHFFFAOYSA-N
Data: 1 KI  1 IC50
Activity Spreadsheet -- Enzyme Inhibition Constant Data from BindingDB
Found 2 hits for monomerid = 50442398
Trg + Lig
Ki
nM
ΔG°
kcal/mole
IC50
nM
Kd
nM
EC50/IC50
nM
koff
s-1
kon
M-1s-1
pHTemp
°C
Sialidase
(Clostridium perfringens)
BDBM50442398
(CHEMBL2442949)
Show SMILES [#6]\[#6](-[#6])=[#6]\[#6]-c1c2-[#8]C([#6])([#6])[#6](=[#6]-c2c(-[#8])c2c1occ(-c1ccc(-[#8])cc1)c2=O)C([#6])([#6])[#6]=[#6] |c:11|
Show InChI InChI=1S/C30H32O5/c1-8-29(4,5)23-15-21-25(32)24-26(33)22(18-10-12-19(31)13-11-18)16-34-28(24)20(14-9-17(2)3)27(21)35-30(23,6)7/h8-13,15-16,31-32H,1,14H2,2-7H3
7.27E+3n/an/an/an/an/an/an/an/a
Graduate School of Gyeongsang National University
Curated by ChEMBL
Assay Description
Non-competitive inhibition of Clostridium perfringens neuraminidase using 4-methylumbelliferyl-alpha-D-N-acetylneuraminic acid sodium salt hydrate as...
Bioorg Med Chem 21: 6398-404 (2013)
Article DOI: 10.1016/j.bmc.2013.08.049
BindingDB Entry DOI: 10.7270/Q2Z89DVN
Sialidase
(Clostridium perfringens)
BDBM50442398
(CHEMBL2442949)
Show SMILES [#6]\[#6](-[#6])=[#6]\[#6]-c1c2-[#8]C([#6])([#6])[#6](=[#6]-c2c(-[#8])c2c1occ(-c1ccc(-[#8])cc1)c2=O)C([#6])([#6])[#6]=[#6] |c:11|
Show InChI InChI=1S/C30H32O5/c1-8-29(4,5)23-15-21-25(32)24-26(33)22(18-10-12-19(31)13-11-18)16-34-28(24)20(14-9-17(2)3)27(21)35-30(23,6)7/h8-13,15-16,31-32H,1,14H2,2-7H3
n/an/a 7.90E+3n/an/an/an/an/an/a
Graduate School of Gyeongsang National University
Curated by ChEMBL
Assay Description
Inhibition of Clostridium perfringens neuraminidase using 4-methylumbelliferyl-alpha-D-N-acetylneuraminic acid sodium salt hydrate as substrate by fl...
Bioorg Med Chem 21: 6398-404 (2013)
Article DOI: 10.1016/j.bmc.2013.08.049
BindingDB Entry DOI: 10.7270/Q2Z89DVN