null
SMILES: OP(O)(=O)C(Nc1ccc(Oc2ccc(Cl)cc2)cc1)P(O)(O)=O
InChI Key: InChIKey=VRCNSKZUURJQAN-UHFFFAOYSA-N
Activity Spreadsheet -- Enzyme Inhibition Constant Data from BindingDB
Found 6 hits for monomerid = 50442509
Trg + Lig
Ki
nM
ΔG°
kcal/mole
IC50
nM
Kd
nM
EC50/IC50
nM
koff
s-1
kon
M-1s-1
pHTemp
°C
Carbonic anhydrase 1
(Homo sapiens (Human))
BDBM50442509
(CHEMBL2440431)
Show SMILES OP(O)(=O)C(Nc1ccc(Oc2ccc(Cl)cc2)cc1)P(O)(O)=O
Show InChI InChI=1S/C13H14ClNO7P2/c14-9-1-5-11(6-2-9)22-12-7-3-10(4-8-12)15-13(23(16,17)18)24(19,20)21/h1-8,13,15H,(H2,16,17,18)(H2,19,20,21)
NCI pathway
Reactome pathway
n/an/a>1.00E+4n/an/an/an/an/an/a
Universit£ degli Studi 'Aldo Moro' di Bari
Curated by ChEMBL
Assay Description
Inhibition of human recombinant carbonic anhydrase 1 preincubated for 15 mins by stopped flow CO2 hydration method
Bioorg Med Chem Lett 24: 1941-3 (2014)
Article DOI: 10.1016/j.bmcl.2014.03.001
BindingDB Entry DOI: 10.7270/Q2PV6MWT
Carbonic anhydrase 2
(Homo sapiens (Human))
BDBM50442509
(CHEMBL2440431)
Show SMILES OP(O)(=O)C(Nc1ccc(Oc2ccc(Cl)cc2)cc1)P(O)(O)=O
Show InChI InChI=1S/C13H14ClNO7P2/c14-9-1-5-11(6-2-9)22-12-7-3-10(4-8-12)15-13(23(16,17)18)24(19,20)21/h1-8,13,15H,(H2,16,17,18)(H2,19,20,21)
Reactome pathway
n/an/a 9.37E+3n/an/an/an/an/an/a
Universit£ degli Studi 'Aldo Moro' di Bari
Curated by ChEMBL
Assay Description
Inhibition of human recombinant carbonic anhydrase 2 preincubated for 15 mins by stopped flow CO2 hydration method
Bioorg Med Chem Lett 24: 1941-3 (2014)
Article DOI: 10.1016/j.bmcl.2014.03.001
BindingDB Entry DOI: 10.7270/Q2PV6MWT
Matrix metalloproteinase-14
(Homo sapiens (Human))
BDBM50442509
(CHEMBL2440431)
Show SMILES OP(O)(=O)C(Nc1ccc(Oc2ccc(Cl)cc2)cc1)P(O)(O)=O
Show InChI InChI=1S/C13H14ClNO7P2/c14-9-1-5-11(6-2-9)22-12-7-3-10(4-8-12)15-13(23(16,17)18)24(19,20)21/h1-8,13,15H,(H2,16,17,18)(H2,19,20,21)
n/an/a 7.60E+4n/an/an/an/an/an/a
Universit£ degli Studi 'Aldo Moro' di Bari
Curated by ChEMBL
Assay Description
Inhibition of MMP14 catalytic domain (unknown origin) using Mca-Pro-Leu-Gly-Leu-Dpa-Ala-Arg-NH2 as substrate incubated for 30 mins prior to substrate...
Bioorg Med Chem 21: 6456-65 (2013)
Article DOI: 10.1016/j.bmc.2013.08.054
BindingDB Entry DOI: 10.7270/Q2222W7K
Carbonic anhydrase 12
(Homo sapiens (Human))
BDBM50442509
(CHEMBL2440431)
Show SMILES OP(O)(=O)C(Nc1ccc(Oc2ccc(Cl)cc2)cc1)P(O)(O)=O
Show InChI InChI=1S/C13H14ClNO7P2/c14-9-1-5-11(6-2-9)22-12-7-3-10(4-8-12)15-13(23(16,17)18)24(19,20)21/h1-8,13,15H,(H2,16,17,18)(H2,19,20,21)
Reactome pathway
n/an/a>1.00E+4n/an/an/an/an/an/a
Universit£ degli Studi 'Aldo Moro' di Bari
Curated by ChEMBL
Assay Description
Inhibition of human recombinant carbonic anhydrase 12 preincubated for 15 mins by stopped flow CO2 hydration method
Bioorg Med Chem Lett 24: 1941-3 (2014)
Article DOI: 10.1016/j.bmcl.2014.03.001
BindingDB Entry DOI: 10.7270/Q2PV6MWT
Carbonic anhydrase 14
(Homo sapiens (Human))
BDBM50442509
(CHEMBL2440431)
Show SMILES OP(O)(=O)C(Nc1ccc(Oc2ccc(Cl)cc2)cc1)P(O)(O)=O
Show InChI InChI=1S/C13H14ClNO7P2/c14-9-1-5-11(6-2-9)22-12-7-3-10(4-8-12)15-13(23(16,17)18)24(19,20)21/h1-8,13,15H,(H2,16,17,18)(H2,19,20,21)
Reactome pathway
n/an/a 4.42E+3n/an/an/an/an/an/a
Universit£ degli Studi 'Aldo Moro' di Bari
Curated by ChEMBL
Assay Description
Inhibition of human recombinant carbonic anhydrase 14 preincubated for 15 mins by stopped flow CO2 hydration method
Bioorg Med Chem Lett 24: 1941-3 (2014)
Article DOI: 10.1016/j.bmcl.2014.03.001
BindingDB Entry DOI: 10.7270/Q2PV6MWT
Carbonic anhydrase 9
(Homo sapiens (Human))
BDBM50442509
(CHEMBL2440431)
Show SMILES OP(O)(=O)C(Nc1ccc(Oc2ccc(Cl)cc2)cc1)P(O)(O)=O
Show InChI InChI=1S/C13H14ClNO7P2/c14-9-1-5-11(6-2-9)22-12-7-3-10(4-8-12)15-13(23(16,17)18)24(19,20)21/h1-8,13,15H,(H2,16,17,18)(H2,19,20,21)
NCI pathway
Reactome pathway
n/an/a 8.23E+3n/an/an/an/an/an/a
Universit£ degli Studi 'Aldo Moro' di Bari
Curated by ChEMBL
Assay Description
Inhibition of human recombinant carbonic anhydrase 9 preincubated for 15 mins by stopped flow CO2 hydration method
Bioorg Med Chem Lett 24: 1941-3 (2014)
Article DOI: 10.1016/j.bmcl.2014.03.001
BindingDB Entry DOI: 10.7270/Q2PV6MWT