BDBM50442896 CHEMBL1328088
SMILES: COC(=O)c1c(C)c2Oc3c(Cl)c(O)c(Cl)c(C)c3C(=O)Oc2c(C)c1O
InChI Key: InChIKey=RCLFRVZNHRFQGE-UHFFFAOYSA-N
Data: 2 KI  2 IC50
Activity Spreadsheet -- Enzyme Inhibition Constant Data from BindingDB
Found 4 hits for monomerid = 50442896
Trg + Lig
Ki
nM
ΔG°
kcal/mole
IC50
nM
Kd
nM
EC50/IC50
nM
koff
s-1
kon
M-1s-1
pHTemp
°C
Solute carrier organic anion transporter family member 1B1 (OATP1B1)
(Homo sapiens (Human))
BDBM50442896
(CHEMBL1328088)
Show SMILES COC(=O)c1c(C)c2Oc3c(Cl)c(O)c(Cl)c(C)c3C(=O)Oc2c(C)c1O
Show InChI InChI=1S/C18H14Cl2O7/c1-5-9-16(11(20)13(22)10(5)19)26-14-6(2)8(17(23)25-4)12(21)7(3)15(14)27-18(9)24/h21-22H,1-4H3
80n/an/an/an/an/an/an/an/a
KU Leuven
Curated by ChEMBL
Assay Description
Ki values for sodium fluorescein (10 uM) uptake in OATP1B1-transfected CHO cells
Mol Pharmacol 83: 1257-67 (2013)
Article DOI: 10.1124/mol.112.084152
BindingDB Entry DOI: 10.7270/Q2TB18BP
Solute carrier organic anion transporter family member 1B3 (OATP1B3)
(Homo sapiens (Human))
BDBM50442896
(CHEMBL1328088)
Show SMILES COC(=O)c1c(C)c2Oc3c(Cl)c(O)c(Cl)c(C)c3C(=O)Oc2c(C)c1O
Show InChI InChI=1S/C18H14Cl2O7/c1-5-9-16(11(20)13(22)10(5)19)26-14-6(2)8(17(23)25-4)12(21)7(3)15(14)27-18(9)24/h21-22H,1-4H3
1.84E+3n/an/an/an/an/an/an/an/a
KU Leuven
Curated by ChEMBL
Assay Description
Ki values for sodium fluorescein (10 uM) uptake in OATP1B3-transfected CHO cells
Mol Pharmacol 83: 1257-67 (2013)
Article DOI: 10.1124/mol.112.084152
BindingDB Entry DOI: 10.7270/Q2TB18BP
Solute carrier organic anion transporter family member 1B1 (OATP1B1)
(Homo sapiens (Human))
BDBM50442896
(CHEMBL1328088)
Show SMILES COC(=O)c1c(C)c2Oc3c(Cl)c(O)c(Cl)c(C)c3C(=O)Oc2c(C)c1O
Show InChI InChI=1S/C18H14Cl2O7/c1-5-9-16(11(20)13(22)10(5)19)26-14-6(2)8(17(23)25-4)12(21)7(3)15(14)27-18(9)24/h21-22H,1-4H3
n/an/a 145n/an/an/an/an/an/a
KU Leuven
Curated by ChEMBL
Assay Description
pIC50 values for sodium fluorescein (10 uM) uptake in OATP1B1-transfected CHO cells
Mol Pharmacol 83: 1257-67 (2013)
Article DOI: 10.1124/mol.112.084152
BindingDB Entry DOI: 10.7270/Q2TB18BP
Solute carrier organic anion transporter family member 1B3 (OATP1B3)
(Homo sapiens (Human))
BDBM50442896
(CHEMBL1328088)
Show SMILES COC(=O)c1c(C)c2Oc3c(Cl)c(O)c(Cl)c(C)c3C(=O)Oc2c(C)c1O
Show InChI InChI=1S/C18H14Cl2O7/c1-5-9-16(11(20)13(22)10(5)19)26-14-6(2)8(17(23)25-4)12(21)7(3)15(14)27-18(9)24/h21-22H,1-4H3
n/an/a 2.40E+3n/an/an/an/an/an/a
KU Leuven
Curated by ChEMBL
Assay Description
pIC50 values for sodium fluorescein (10 uM) uptake in OATP1B3-transfected CHO cells
Mol Pharmacol 83: 1257-67 (2013)
Article DOI: 10.1124/mol.112.084152
BindingDB Entry DOI: 10.7270/Q2TB18BP