BDBM50443051 CHEMBL3087937
SMILES: OP(O)(=O)C(Nc1ncnc2sc(cc12)-c1ccc(cc1)C1CC1)P(O)(O)=O
InChI Key: InChIKey=VIGDNIIDHDWALF-UHFFFAOYSA-N
Data: 2 IC50
PDB links: 1 PDB ID matches this monomer.
Activity Spreadsheet -- Enzyme Inhibition Constant Data from BindingDB
Found 2 hits for monomerid = 50443051
Trg + Lig
Ki
nM
ΔG°
kcal/mole
IC50
nM
Kd
nM
EC50/IC50
nM
koff
s-1
kon
M-1s-1
pHTemp
°C
Farnesyl diphosphate synthase
(Homo sapiens (Human))
BDBM50443051
(CHEMBL3087937)
Show SMILES OP(O)(=O)C(Nc1ncnc2sc(cc12)-c1ccc(cc1)C1CC1)P(O)(O)=O
Show InChI InChI=1S/C16H17N3O6P2S/c20-26(21,22)16(27(23,24)25)19-14-12-7-13(28-15(12)18-8-17-14)11-5-3-10(4-6-11)9-1-2-9/h3-9,16H,1-2H2,(H,17,18,19)(H2,20,21,22)(H2,23,24,25)
Reactome pathway
n/an/a 115n/an/an/an/an/an/a
McGill University
Curated by ChEMBL
Assay Description
Inhibition of human recombinant FPPS using GPP/[3H]IPP as substrate incubated for 10 mins prior to substrate addition by scintillation counting analy...
J Med Chem 56: 7939-50 (2013)
Article DOI: 10.1021/jm400946f
BindingDB Entry DOI: 10.7270/Q20V8F6B
3D
3D Structure (crystal)
Farnesyl diphosphate synthase
(Homo sapiens (Human))
BDBM50443051
(CHEMBL3087937)
Show SMILES OP(O)(=O)C(Nc1ncnc2sc(cc12)-c1ccc(cc1)C1CC1)P(O)(O)=O
Show InChI InChI=1S/C16H17N3O6P2S/c20-26(21,22)16(27(23,24)25)19-14-12-7-13(28-15(12)18-8-17-14)11-5-3-10(4-6-11)9-1-2-9/h3-9,16H,1-2H2,(H,17,18,19)(H2,20,21,22)(H2,23,24,25)
Reactome pathway
n/an/a 39n/an/an/an/an/an/a
McGill University
Curated by ChEMBL
Assay Description
Inhibition of human recombinant FPPS using GPP/[3H]IPP as substrate incubated for 10 mins prior to substrate addition measured after 8 mins by scinti...
J Med Chem 56: 7939-50 (2013)
Article DOI: 10.1021/jm400946f
BindingDB Entry DOI: 10.7270/Q20V8F6B
3D
3D Structure (crystal)