BDBM50443233 CHEMBL3087052
SMILES: Cc1cc(cc(C)c1O)N=Nc1ccc(cc1)S(=O)(=O)Nc1ccccn1
InChI Key: InChIKey=UPZISPNEBVCTRN-UHFFFAOYSA-N
Data: 7 KI  2 IC50
PDB links: 1 PDB ID matches this monomer.
Activity Spreadsheet -- Enzyme Inhibition Constant Data from BindingDB
Found 9 hits for monomerid = 50443233
Trg + Lig
Ki
nM
ΔG°
kcal/mole
IC50
nM
Kd
nM
EC50/IC50
nM
koff
s-1
kon
M-1s-1
pHTemp
°C
Bromodomain-containing protein 4
(Homo sapiens (Human))
BDBM50443233
(CHEMBL3087052)
Show SMILES Cc1cc(cc(C)c1O)N=Nc1ccc(cc1)S(=O)(=O)Nc1ccccn1 |w:9.9|
Show InChI InChI=1S/C19H18N4O3S/c1-13-11-16(12-14(2)19(13)24)22-21-15-6-8-17(9-7-15)27(25,26)23-18-5-3-4-10-20-18/h3-12,24H,1-2H3,(H,20,23)
910n/an/an/an/an/an/an/an/a
Icahn School of Medicine at Mount Sinai
Curated by ChEMBL
Assay Description
Displacement of fluorescein-labeled MS574 from recombinant human BRD4 BrD1 after 1 hr by fluorescence anisotropy assay
J Med Chem 56: 9251-64 (2013)
Article DOI: 10.1021/jm401334s
BindingDB Entry DOI: 10.7270/Q2ZW1NCF
3D
3D Structure (crystal)
Bromodomain-containing protein 4
(Homo sapiens (Human))
BDBM50443233
(CHEMBL3087052)
Show SMILES Cc1cc(cc(C)c1O)N=Nc1ccc(cc1)S(=O)(=O)Nc1ccccn1 |w:9.9|
Show InChI InChI=1S/C19H18N4O3S/c1-13-11-16(12-14(2)19(13)24)22-21-15-6-8-17(9-7-15)27(25,26)23-18-5-3-4-10-20-18/h3-12,24H,1-2H3,(H,20,23)
912n/an/an/an/an/an/an/an/a
Icahn School of Medicine at Mount Sinai
Curated by ChEMBL
Assay Description
Displacement of fluorescein-labeled MS574 from recombinant human BRD4 BrD1 after 1 hr by fluorescence anisotropy assay
J Med Chem 56: 9251-64 (2013)
Article DOI: 10.1021/jm401334s
BindingDB Entry DOI: 10.7270/Q2ZW1NCF
3D
3D Structure (crystal)
Bromodomain-containing protein 3
(Homo sapiens (Human))
BDBM50443233
(CHEMBL3087052)
Show SMILES Cc1cc(cc(C)c1O)N=Nc1ccc(cc1)S(=O)(=O)Nc1ccccn1 |w:9.9|
Show InChI InChI=1S/C19H18N4O3S/c1-13-11-16(12-14(2)19(13)24)22-21-15-6-8-17(9-7-15)27(25,26)23-18-5-3-4-10-20-18/h3-12,24H,1-2H3,(H,20,23)
1.64E+3n/an/an/an/an/an/an/an/a
Icahn School of Medicine at Mount Sinai
Curated by ChEMBL
Assay Description
Displacement of fluorescein-labeled MS574 from recombinant human BRD3 BrD1 after 1 hr by fluorescence anisotropy assay
J Med Chem 56: 9251-64 (2013)
Article DOI: 10.1021/jm401334s
BindingDB Entry DOI: 10.7270/Q2ZW1NCF
Bromodomain-containing protein 3
(Homo sapiens (Human))
BDBM50443233
(CHEMBL3087052)
Show SMILES Cc1cc(cc(C)c1O)N=Nc1ccc(cc1)S(=O)(=O)Nc1ccccn1 |w:9.9|
Show InChI InChI=1S/C19H18N4O3S/c1-13-11-16(12-14(2)19(13)24)22-21-15-6-8-17(9-7-15)27(25,26)23-18-5-3-4-10-20-18/h3-12,24H,1-2H3,(H,20,23)
2.48E+3n/an/an/an/an/an/an/an/a
Icahn School of Medicine at Mount Sinai
Curated by ChEMBL
Assay Description
Displacement of fluorescein-labeled MS574 from recombinant human BRD3 BrD2 after 1 hr by fluorescence anisotropy assay
J Med Chem 56: 9251-64 (2013)
Article DOI: 10.1021/jm401334s
BindingDB Entry DOI: 10.7270/Q2ZW1NCF
Bromodomain-containing protein 7
(Homo sapiens (Human))
BDBM50443233
(CHEMBL3087052)
Show SMILES Cc1cc(cc(C)c1O)N=Nc1ccc(cc1)S(=O)(=O)Nc1ccccn1 |w:9.9|
Show InChI InChI=1S/C19H18N4O3S/c1-13-11-16(12-14(2)19(13)24)22-21-15-6-8-17(9-7-15)27(25,26)23-18-5-3-4-10-20-18/h3-12,24H,1-2H3,(H,20,23)
3.54E+3n/an/an/an/an/an/an/an/a
Icahn School of Medicine at Mount Sinai
Curated by ChEMBL
Assay Description
Displacement of fluorescein-labeled MS226 from recombinant human BRD7 after 1 hr by fluorescence anisotropy assay
J Med Chem 56: 9251-64 (2013)
Article DOI: 10.1021/jm401334s
BindingDB Entry DOI: 10.7270/Q2ZW1NCF
Bromodomain-containing protein 4
(Homo sapiens (Human))
BDBM50443233
(CHEMBL3087052)
Show SMILES Cc1cc(cc(C)c1O)N=Nc1ccc(cc1)S(=O)(=O)Nc1ccccn1 |w:9.9|
Show InChI InChI=1S/C19H18N4O3S/c1-13-11-16(12-14(2)19(13)24)22-21-15-6-8-17(9-7-15)27(25,26)23-18-5-3-4-10-20-18/h3-12,24H,1-2H3,(H,20,23)
4.30E+3n/an/an/an/an/an/an/an/a
Icahn School of Medicine at Mount Sinai
Curated by ChEMBL
Assay Description
Displacement of fluorescein-labeled MS574 from recombinant human BRD4 BrD2 after 1 hr by fluorescence anisotropy assay
J Med Chem 56: 9251-64 (2013)
Article DOI: 10.1021/jm401334s
BindingDB Entry DOI: 10.7270/Q2ZW1NCF
3D
3D Structure (crystal)
CREB-binding protein
(Homo sapiens (Human))
BDBM50443233
(CHEMBL3087052)
Show SMILES Cc1cc(cc(C)c1O)N=Nc1ccc(cc1)S(=O)(=O)Nc1ccccn1 |w:9.9|
Show InChI InChI=1S/C19H18N4O3S/c1-13-11-16(12-14(2)19(13)24)22-21-15-6-8-17(9-7-15)27(25,26)23-18-5-3-4-10-20-18/h3-12,24H,1-2H3,(H,20,23)
Reactome pathway
7.15E+3n/an/an/an/an/an/an/an/a
Icahn School of Medicine at Mount Sinai
Curated by ChEMBL
Assay Description
Displacement of fluorescein-labeled MS226 from recombinant human CBP bromodomain after 1 hr by fluorescence anisotropy assay
J Med Chem 56: 9251-64 (2013)
Article DOI: 10.1021/jm401334s
BindingDB Entry DOI: 10.7270/Q2ZW1NCF
Bromodomain-containing protein 4
(Mus musculus)
BDBM50443233
(CHEMBL3087052)
Show SMILES Cc1cc(cc(C)c1O)N=Nc1ccc(cc1)S(=O)(=O)Nc1ccccn1 |w:9.9|
Show InChI InChI=1S/C19H18N4O3S/c1-13-11-16(12-14(2)19(13)24)22-21-15-6-8-17(9-7-15)27(25,26)23-18-5-3-4-10-20-18/h3-12,24H,1-2H3,(H,20,23)
n/an/a 1.60E+4n/an/an/an/an/an/a
Icahn School of Medicine at Mount Sinai
Curated by ChEMBL
Assay Description
Inhibition of BRD4 in LPS-stimulated mouse RAW264.7 cells assessed as inhibition of NF-kappaB-mediated IL-6 expression preincubated for 30 mins follo...
J Med Chem 56: 9251-64 (2013)
Article DOI: 10.1021/jm401334s
BindingDB Entry DOI: 10.7270/Q2ZW1NCF
3D
3D Structure (crystal)
Bromodomain-containing protein 4
(Mus musculus)
BDBM50443233
(CHEMBL3087052)
Show SMILES Cc1cc(cc(C)c1O)N=Nc1ccc(cc1)S(=O)(=O)Nc1ccccn1 |w:9.9|
Show InChI InChI=1S/C19H18N4O3S/c1-13-11-16(12-14(2)19(13)24)22-21-15-6-8-17(9-7-15)27(25,26)23-18-5-3-4-10-20-18/h3-12,24H,1-2H3,(H,20,23)
n/an/a 4.63E+4n/an/an/an/an/an/a
Icahn School of Medicine at Mount Sinai
Curated by ChEMBL
Assay Description
Inhibition of BRD4 in LPS-stimulated mouse RAW264.7 cells assessed as inhibition of NF-kappaB-mediated nitric oxide production preincubated for 30 mi...
J Med Chem 56: 9251-64 (2013)
Article DOI: 10.1021/jm401334s
BindingDB Entry DOI: 10.7270/Q2ZW1NCF
3D
3D Structure (crystal)