null
SMILES: CCN(CC)CC(=O)N[C@@H]1CC[C@H]([C@@H](C1)c1ccc(Br)cc1)C(=O)NC(c1ccc(F)cc1)c1ccc(F)cc1
InChI Key: InChIKey=JMSGNVAFJFRXTL-NLDZOOGBSA-N
Activity Spreadsheet -- Enzyme Inhibition Constant Data from BindingDB
Found 3 hits for monomerid = 50443343
Trg + Lig
Ki
nM
ΔG°
kcal/mole
IC50
nM
Kd
nM
EC50/IC50
nM
koff
s-1
kon
M-1s-1
pHTemp
°C
Lysosomal Pro-X carboxypeptidase
(Homo sapiens (Human))
BDBM50443343
(CHEMBL3086028 | US8669252, 56)
Show SMILES CCN(CC)CC(=O)N[C@@H]1CC[C@H]([C@@H](C1)c1ccc(Br)cc1)C(=O)NC(c1ccc(F)cc1)c1ccc(F)cc1 |r|
Show InChI InChI=1S/C32H36BrF2N3O2/c1-3-38(4-2)20-30(39)36-27-17-18-28(29(19-27)21-5-11-24(33)12-6-21)32(40)37-31(22-7-13-25(34)14-8-22)23-9-15-26(35)16-10-23/h5-16,27-29,31H,3-4,17-20H2,1-2H3,(H,36,39)(H,37,40)/t27-,28-,29+/m1/s1
Reactome pathway
US Patent
n/an/a 17n/an/an/an/an/an/a
Merck Sharp & Dohme Corp.
US Patent
Assay Description
The potency of compounds of formula I against PrCP was determined by a fluorescence intensity kinetic assay measuring the IC50 values of PrCP inhibit...
US Patent US8669252 (2014)
BindingDB Entry DOI: 10.7270/Q2J9652X
Lysosomal Pro-X carboxypeptidase
(Homo sapiens (Human))
BDBM50443343
(CHEMBL3086028 | US8669252, 56)
Show SMILES CCN(CC)CC(=O)N[C@@H]1CC[C@H]([C@@H](C1)c1ccc(Br)cc1)C(=O)NC(c1ccc(F)cc1)c1ccc(F)cc1 |r|
Show InChI InChI=1S/C32H36BrF2N3O2/c1-3-38(4-2)20-30(39)36-27-17-18-28(29(19-27)21-5-11-24(33)12-6-21)32(40)37-31(22-7-13-25(34)14-8-22)23-9-15-26(35)16-10-23/h5-16,27-29,31H,3-4,17-20H2,1-2H3,(H,36,39)(H,37,40)/t27-,28-,29+/m1/s1
Reactome pathway
n/an/a 17n/an/an/an/an/an/a
Merck Research Laboratories
Curated by ChEMBL
Assay Description
Inhibition of recombinant human PrCP using Mca-Ala-Pro-Lys(Dnp)-OH as substrate measured for 30 mins by fluorescence assay
Bioorg Med Chem Lett 23: 6228-33 (2013)
Article DOI: 10.1016/j.bmcl.2013.09.094
BindingDB Entry DOI: 10.7270/Q2DZ09Q4
Lysosomal Pro-X carboxypeptidase
(Mus musculus)
BDBM50443343
(CHEMBL3086028 | US8669252, 56)
Show SMILES CCN(CC)CC(=O)N[C@@H]1CC[C@H]([C@@H](C1)c1ccc(Br)cc1)C(=O)NC(c1ccc(F)cc1)c1ccc(F)cc1 |r|
Show InChI InChI=1S/C32H36BrF2N3O2/c1-3-38(4-2)20-30(39)36-27-17-18-28(29(19-27)21-5-11-24(33)12-6-21)32(40)37-31(22-7-13-25(34)14-8-22)23-9-15-26(35)16-10-23/h5-16,27-29,31H,3-4,17-20H2,1-2H3,(H,36,39)(H,37,40)/t27-,28-,29+/m1/s1
Reactome pathway
n/an/a 1.20n/an/an/an/an/an/a
Merck Research Laboratories
Curated by ChEMBL
Assay Description
Inhibition of recombinant mouse PrCP using Mca-Ala-Pro-Lys(Dnp)-OH as substrate measured for 30 mins by fluorescence assay
Bioorg Med Chem Lett 23: 6228-33 (2013)
Article DOI: 10.1016/j.bmcl.2013.09.094
BindingDB Entry DOI: 10.7270/Q2DZ09Q4